{"text_format":"1","workbook":"xlsx","n_sheets":12,"sheets":["Main","Part A - Exporting","Part A - Importing","Part B - Exporting","Part B - Importing","Part C - Exporting","Part C - Importing","Part C - Add Coms Exporting","Part C - Add Coms Importing","Contrib Refs Res","Non editable text ","Uncertainy tables (Beta)"],"not_rendered":{"charts":243,"images":34,"macros":1,"external_links":0,"defined_names":59,"comments":6,"pivot_tables":0},"unopened":[],"bounds":{"document_bytes":16777216,"sheet_cells":100000,"rows_first":2000,"rows_last":500,"rows_between":2000,"halvings":0,"cell_chars":16384,"cell_head_chars":4096},"cells_cut":0,"cells_raw":0,"read":"whole","date_system":"1900"}

{"sheet":"Main","index":0,"n_rows":4,"n_cols":27,"rows_kept":4,"cut":false,"hidden":false,"merged":[]}
[null,"全球超越合规 — 系统方法决策支持（DSSA）"]
[null,{"$f":"IF(E4=AA2,IF(OR(ISBLANK('Part A - Exporting'!D7),ISBLANK('Part A - Exporting'!D11),ISBLANK('Part A - Exporting'!D9),ISBLANK('Part A - Exporting'!D10)),\"完成A部分，定义作物、有害生物和贸易国家\",\"开发从 \"&'Part A - Exporting'!D9&\" 到 \"&'Part A - Exporting'!D10&\"的\"&'Part A - Exporting'!D7&\" 贸易系统方法-针对\"&'Part A - Exporting'!D11),IF(E4=AA3,IF(OR(ISBLANK('Part A - Importing'!D7),ISBLANK('Part A - Importing'!D11),ISBLANK('Part A - Importing'!D9),ISBLANK('Part A - Importing'!D10)),\"完成A部分，定义作物、有害生物和贸易国家\",\"开发从 \"&'Part A - Importing'!D9&\" 到 \"&'Part A - Importing'!D10&\"的\"&'Part A - Importing'!D7&\" 贸易系统方法-针对\"&'Part A - Importing'!D11),\"从下面的下拉框中选择工具是用于导入或导出\"))","v":"完成A部分，定义作物、有害生物和贸易国家"},null,null,null,null,null,null,null,null,null,null,null,null,null,null,null,null,null,null,null,null,null,null,null,null,"出口"]
[null,null,null,null,null,null,null,null,null,"版本日期：","2021-06-28",null,null,null,null,null,null,null,null,null,null,null,null,null,null,null,"进口"]
[null,null,"工具用途：",null,"进口"]

{"sheet":"Part A - Exporting","index":1,"n_rows":53,"n_cols":31,"rows_kept":53,"cut":false,"hidden":true,"merged":[[5,2,5,3],[15,4,15,5],[17,4,17,5],[18,4,18,5],[22,2,22,8],[23,5,23,8],[24,5,24,8],[25,5,25,8],[26,5,26,8],[27,5,27,8],[28,3,28,4],[28,5,28,8],[29,3,29,4],[29,5,29,8],[30,3,30,4],[30,5,30,8],[31,3,31,4],[31,5,31,8],[32,3,32,4],[32,5,32,8],[33,3,33,4],[33,5,33,8],[35,1,35,8],[36,1,37,8]]}
[null,{"$f":"Main!B1","v":"全球超越合规 — 系统方法决策支持（DSSA）"},null,null,null,null,null,null,null,null,null,null,null,null,null,null,null,null,null,null,null,null,null,null,"下拉框文本：",null,{"$f":"IF(ISERROR(VLOOKUP($F1,#REF!,15,0)),\"\",VLOOKUP($F1,#REF!,15,0))","v":""},{"$f":"IF(ISERROR(VLOOKUP($F1,#REF!,16,0)),\"\",VLOOKUP($F1,#REF!,16,0))","v":""},null,{"$f":"IF(ISERROR(VLOOKUP($F1,#REF!,15,0)),\"\",VLOOKUP($F1,#REF!,15,0))","v":""},{"$f":"IF(ISERROR(VLOOKUP($F1,#REF!,16,0)),\"\",VLOOKUP($F1,#REF!,16,0))","v":""}]
[null,{"$f":"IF(OR(ISBLANK('Part A - Exporting'!D7),ISBLANK('Part A - Exporting'!D9),ISBLANK('Part A - Exporting'!D10),ISBLANK('Part A - Exporting'!D11)),\"A部分：制定系统方法的背景信息\",\"A部分：开发从 \"&'Part A - Exporting'!D9&\" 到 \"&'Part A - Exporting'!D10&\"的\"&'Part A - Exporting'!D7&\" 贸易系统方法-针对\"&'Part A - Exporting'!D11)","v":"A部分：制定系统方法的背景信息"},null,null,null,null,null,null,null,null,null,null,null,null,null,null,null,null,null,null,null,null,null,null,"是","新贸易","无限制","很容易","组织良好"]
[null,"出口版本",null,null,null,null,null,null,null,null,null,null,null,null,null,null,null,null,null,null,null,null,null,null,"否","保持贸易","无疫区","容易","组织良好 "]
[null,null,null,null,null,null,null,null,null,null,null,null,null,null,null,null,null,null,null,null,null,null,null,null,null,"风险改变","无疫产地或场所","较为容易","有一定的组织程度"]
[null,null,null,null,null,null,null,null,null,null,null,null,null,null,null,null,null,null,null,null,null,null,null,null,null,"替代措施等效性","有害生物低度流行区","困难","无正式组织"]
[null,null,"表A1.基本信息",null,null,null,null,null,null,null,null,null,null,null,null,null,null,null,null,null,null,null,null,null,null,"其他","官方控制区域","非常困难","无组织意愿"]
[null,"A.1.01","确定该管理计划涉及的商品或途径",null,null,null,null,null,null,null,null,null,null,null,null,null,null,null,null,null,null,null,null,null,null,null,"注册生产商或生产场所"]
[null,"A.1.02","商品/途径的预期用途 "]
[null,"A.1.03","原出口国（原产国）"]
[null,"A.1.04","进口国"]
[null,"A.1.05","本管理计划中涉及的由进口国发现的限定有害生物"]
[null,"A.1.06","有害生物风险分析中考虑的入境方式（商业贸易[空运、海运、陆运、邮政]；非正式贸易；自然扩散……）"]
[null,"A.1.07","本管理计划涵盖的申报运输工具"]
[null,"A.1.08","该计划涵盖进口国的哪一部分？（整个国家还是特定的区域？）"]
[null,"A.1.09","该计划覆盖区域中的主要寄主植物"]
[null,"A.1.10","有害生物风险分析是否指示评估有害生物风险的特定时间段？",null,{"$f":"IF(D16=$Y$2,\"在“资源”工作表上添加/查看详细信息\",\"\")","v":""}]
[null,"A.1.11","描述对出口生产区域的任何限制（请参见下拉菜单）。"]
[null,"A.1.12","从类似的现有贸易中是否可获得有用的信息？",null,{"$f":"IF(D18=Y2,\"在“资源”工作表上添加/查看详细信息\",\"\")","v":""}]
[null,"A.1.13","该计划的启动驱动因素是什么？",null,{"$f":"IF(D19=Z6,\"在“资源”工作表上添加/查看详细信息\",\"\")","v":""}]
[]
[]
[]
[null,null,"表A2.根据拟议的商品/途径考虑的关键因素"]
[null,null,"关键因素 ","评分","不确定性","说明"]
[null,"A2.01","评分-进入"]
[null,"A2.02","评分-定殖"]
[null,"A2.03","评分-扩散"]
[null,"A2.04","评分-影响"]
[null,null,null,"描述",null,"评论意见"]
[null,"A2.05","检测商品/途径上的关键生物体有多容易？  例如，你能识别样本上的症状或体征吗？"]
[null,"A2.06","识别关键生物体有多容易？例如，是否有一种已经被认可的可用的、可靠的、精确的技术？"]
[null,"A2.07","进口国面临风险的行业组织情况如何？"]
[null,"A2.08","如果有害生物进入进口国，是否有办法（目前可行的措施）控制或根除该有害生物？"]
[null,"A2.09","是否有机制可以帮助在整个行业内采取措施？"]
[]
[null,"A2.与风险管理措施相关的关键因素的结论：   "]
[null,"此处应添加风险管理措施的结论。"]
[]
[]
[]
[]
[]
[]
[]
[]
[]
[]
[]
[]
[]
[]
[]
[null,null,null,null,null,null,{"$f":"IF(NOT(ISBLANK(E39)),\"If this is your selection then please proceed to Part B>>>\",\"\")","v":""}]

{"sheet":"Part A - Importing","index":2,"n_rows":53,"n_cols":31,"rows_kept":53,"cut":false,"hidden":false,"merged":[[5,2,5,3],[15,4,15,5],[17,4,17,5],[18,4,18,5],[22,2,22,8],[23,5,23,8],[24,5,24,8],[25,5,25,8],[26,5,26,8],[27,5,27,8],[28,3,28,4],[28,5,28,8],[29,3,29,4],[29,5,29,8],[30,3,30,4],[30,5,30,8],[31,3,31,4],[31,5,31,8],[32,3,32,4],[32,5,32,8],[33,3,33,4],[33,5,33,8],[35,1,35,8],[36,1,37,8]]}
[null,{"$f":"Main!B1","v":"全球超越合规 — 系统方法决策支持（DSSA）"},null,null,null,null,null,null,null,null,null,null,null,null,null,null,null,null,null,null,null,null,null,null,"下拉框文本：",null,{"$f":"IF(ISERROR(VLOOKUP($F1,#REF!,15,0)),\"\",VLOOKUP($F1,#REF!,15,0))","v":""},{"$f":"IF(ISERROR(VLOOKUP($F1,#REF!,16,0)),\"\",VLOOKUP($F1,#REF!,16,0))","v":""},null,{"$f":"IF(ISERROR(VLOOKUP($F1,#REF!,15,0)),\"\",VLOOKUP($F1,#REF!,15,0))","v":""},{"$f":"IF(ISERROR(VLOOKUP($F1,#REF!,16,0)),\"\",VLOOKUP($F1,#REF!,16,0))","v":""}]
[null,{"$f":"IF(OR(ISBLANK('Part A - Importing'!D7),ISBLANK('Part A - Importing'!D9),ISBLANK('Part A - Importing'!D10),ISBLANK('Part A - Importing'!D11)),\"A部分：制定系统方法的背景信息\",\"A部分：开发从 \"&'Part A - Importing'!D9&\" 到 \"&'Part A - Importing'!D10&\"的\"&'Part A - Importing'!D7&\" 贸易系统方法-针对\"&'Part A - Importing'!D11)","v":"A部分：制定系统方法的背景信息"},null,null,null,null,null,null,null,null,null,null,null,null,null,null,null,null,null,null,null,null,null,null,"是","新贸易","无限制","很容易","组织良好"]
[null,"进口版本",null,null,null,null,null,null,null,null,null,null,null,null,null,null,null,null,null,null,null,null,null,null,"否","保持贸易","无疫区","容易","组织良好 "]
[null,null,null,null,null,null,null,null,null,null,null,null,null,null,null,null,null,null,null,null,null,null,null,null,null,"风险改变","无疫产地或场所","较为容易","有一定的组织程度"]
[null,null,null,null,null,null,null,null,null,null,null,null,null,null,null,null,null,null,null,null,null,null,null,null,null,"替代措施等效性","有害生物低度流行区","困难","无正式组织"]
[null,null,"表A1.基本信息",null,null,null,null,null,null,null,null,null,null,null,null,null,null,null,null,null,null,null,null,null,null,"其他","官方控制区域","非常困难","无组织意愿"]
[null,"A.1.01","确定该管理计划涉及的商品或途径",null,null,null,null,null,null,null,null,null,null,null,null,null,null,null,null,null,null,null,null,null,null,null,"注册生产商或生产场所"]
[null,"A.1.02","商品/途径的预期用途 "]
[null,"A.1.03","原出口国（原产国）"]
[null,"A.1.04","进口国"]
[null,"A.1.05","本管理计划中涉及的由进口国发现的限定有害生物"]
[null,"A.1.06","有害生物风险分析中考虑的入境方式（商业贸易[空运、海运、陆运、邮政]；非正式贸易；自然扩散……）"]
[null,"A.1.07","本管理计划涵盖的申报运输工具"]
[null,"A.1.08","该计划涵盖进口国的哪一部分？（整个国家还是特定的区域？）"]
[null,"A.1.09","该计划覆盖区域中的主要寄主植物"]
[null,"A.1.10","有害生物风险分析是否指示评估有害生物风险的特定时间段？",null,{"$f":"IF(D16=$Y$2,\"Add/see details on 'Resource' worksheet\",\"\")","v":""}]
[null,"A.1.11","描述对出口生产区域的任何限制（请参见下拉菜单）。"]
[null,"A.1.12","从类似的现有贸易中是否可获得有用的信息？",null,{"$f":"IF(D18=Y2,\"Add/see details on 'Resource' worksheet\",\"\")","v":""}]
[null,"A.1.13","该计划的启动驱动因素是什么？",null,{"$f":"IF(D19=Z6,\"Add/see details on 'Resource' worksheet\",\"\")","v":""}]
[]
[]
[]
[null,null,"表A2.根据拟议的商品/途径考虑的关键因素"]
[null,null,"关键因素 ","评分","不确定性","说明"]
[null,"A2.01","评分-进入"]
[null,"A2.02","评分-定殖"]
[null,"A2.03","评分-扩散"]
[null,"A2.04","评分-影响"]
[null,null,null,"描述",null,"评论意见"]
[null,"A2.05","检测商品/途径上的关键生物体有多容易？  例如，你能识别样本上的症状或体征吗？"]
[null,"A2.06","识别关键生物体有多容易？例如，是否有一种已经被认可的可用的、可靠的、精确的技术？"]
[null,"A2.07","进口国面临风险的行业组织情况如何？"]
[null,"A2.08","如果有害生物进入进口国，是否有办法（目前可行的措施）控制或根除该有害生物？"]
[null,"A2.09","是否有机制可以帮助在整个行业内采取措施？"]
[]
[null,"A2.与风险管理措施相关的关键因素的结论：   "]
[null,"风险管理措施较为有效"]
[]
[]
[]
[]
[]
[]
[]
[]
[]
[]
[]
[]
[]
[]
[]
[null,null,null,null,null,null,{"$f":"IF(NOT(ISBLANK(E39)),\"If this is your selection then please proceed to Part B>>>\",\"\")","v":""}]

{"sheet":"Part B - Exporting","index":3,"n_rows":120,"n_cols":9,"rows_kept":120,"cut":false,"hidden":true,"merged":[[111,1,111,4],[5,1,7,1],[28,1,30,1],[5,2,7,2],[28,2,30,2],[5,3,7,3],[28,3,30,3],[5,4,7,4],[28,4,30,4],[5,5,7,5],[28,5,30,5],[5,6,7,6],[28,6,30,6],[5,7,7,7],[28,7,30,7],[5,8,7,8],[28,8,30,8],[45,5,51,7]]}
[null,{"$f":"Main!B1","v":"全球超越合规 — 系统方法决策支持（DSSA）"}]
[null,{"$f":"IF(OR(ISBLANK('Part A - Exporting'!D7),ISBLANK('Part A - Exporting'!D9),ISBLANK('Part A - Exporting'!D10),ISBLANK('Part A - Exporting'!D11)),\"B部分：制定系统方法的措施选择\",\"B部分：为开发从 \"&'Part A - Exporting'!D9&\" 到 \"&'Part A - Exporting'!D10&\"的\"&'Part A - Exporting'!D7&\" 贸易系统方法选择措施-针对\"&'Part A - Exporting'!D11)","v":"B部分：制定系统方法的措施选择"}]
[null,"出口版本"]
[]
[null,"表A1.  生产链中可能使用的所有可能措施列表"]
[null,"区域和农场状态","季前","产中","收获","收获后处理 — 农场","收获后处理 — 集中","出口","到达进口国"]
[]
[]
[]
[]
[]
[]
[]
[]
[]
[]
[]
[]
[]
[]
[]
[]
[]
[null,null,null,"表B1中列出的所有措施的数量：",{"$f":"COUNTA(B10:I22)","v":0}]
[]
[]
[null,"表B2.DSSA评价入围候选措施表 — 下拉列表取自表B1（列出了所有可能的措施）。  "]
[null,"DSSA在系统方法中不允许超过20种措施"]
[null,{"$f":"B6","v":"区域和农场状态"},"季前","产中","收获","收获后处理 — 农场","收获后处理 — 集中","出口","到达进口国"]
[]
[]
[]
[]
[]
[]
[]
[]
[]
[]
[]
[]
[]
[]
[]
[]
[null,null,null,"表B2中列出的入围候选措施的数量：",{"$f":"COUNTA(B32:I44)","v":0},{"$f":"IF(E46>20,CONCATENATE(B108,B109,B110),\"\")","v":""}]
[]
[]
[null,"表B3.添加每项措施的目标"]
[null,"供C部分使用的入围候选措施"]
[null,"措施","目标"]
[]
[]
[]
[]
[]
[]
[]
[]
[]
[]
[]
[]
[]
[]
[]
[]
[]
[]
[]
[]
[]
[]
[]
[]
[]
[]
[]
[]
[]
[]
[]
[]
[]
[]
[]
[]
[]
[]
[]
[]
[]
[]
[]
[]
[]
[]
[]
[]
[]
[]
[]
[]
[]
[]
[]
[]
[null,"在DSSA中可以评估的最大措施数量 = 20。 "]
[null," 通过合并表B1中的相关措施并在表B2中重新选择它们来减少措施的数量。"]
[null," 例如，不要列出单个农药，而是将它们纳入一个术语，如“农药制度”，可在C部分中该措施的说明框中详细描述。"]
[]
[null,"建议的目标分类"]
[null,"指出有害生物挑战/侵染的程度"]
[null,"降低有害生物挑战"]
[null,"防止有害生物侵染"]
[null,"降低有害生物侵染"]
[null,"防止再次侵染"]
[null,"措施事实证明"]
[null,"验证实施效果"]
[null,"可追溯性"]

{"sheet":"Part B - Importing","index":4,"n_rows":120,"n_cols":9,"rows_kept":120,"cut":false,"hidden":false,"merged":[[111,1,111,4],[5,1,7,1],[28,1,30,1],[5,2,7,2],[28,2,30,2],[5,3,7,3],[28,3,30,3],[5,4,7,4],[28,4,30,4],[5,5,7,5],[28,5,30,5],[5,6,7,6],[28,6,30,6],[5,7,7,7],[28,7,30,7],[5,8,7,8],[28,8,30,8],[45,5,51,7]]}
[null,{"$f":"Main!B1","v":"全球超越合规 — 系统方法决策支持（DSSA）"}]
[null,{"$f":"IF(OR(ISBLANK('Part A - Importing'!D7),ISBLANK('Part A - Importing'!D9),ISBLANK('Part A - Importing'!D10),ISBLANK('Part A - Importing'!D11)),\"B部分：制定系统方法的措施选择\",\"B部分：为开发从 \"&'Part A - Importing'!D9&\" 到 \"&'Part A - Importing'!D10&\"的\"&'Part A - Importing'!D7&\" 贸易系统方法选择措施-针对\"&'Part A - Importing'!D11)","v":"B部分：制定系统方法的措施选择"}]
[null,"进口版本"]
[]
[null,"表A1.  生产链中可能使用的所有可能措施列表"]
[null,"区域和农场状态","季前","产中","收获","收获后处理 — 农场","收获后处理 — 集中","出口","到达进口国"]
[]
[]
[]
[]
[]
[]
[]
[]
[]
[]
[]
[]
[]
[]
[]
[]
[]
[null,null,null,"表B1中列出的所有措施的数量：",{"$f":"COUNTA(B10:I22)","v":0}]
[]
[]
[null,"表B2.DSSA评价入围候选措施表 — 下拉列表取自表B1（列出了所有可能的措施）。  "]
[null,"DSSA在系统方法中不允许超过20种措施"]
[null,{"$f":"B6","v":"区域和农场状态"},"季前","产中","收获","收获后处理 — 农场","收获后处理 — 集中","出口","到达进口国"]
[]
[]
[]
[]
[]
[]
[]
[]
[]
[]
[]
[]
[]
[]
[]
[]
[null,null,null,"表B2中列出的入围候选措施的数量：",{"$f":"COUNTA(B32:I44)","v":0},{"$f":"IF(E46>20,CONCATENATE(B108,B109,B110),\"\")","v":""}]
[]
[]
[null,"表B3.添加每项措施的目标"]
[null,"供C部分使用的入围候选措施"]
[null,"措施","目标"]
[null,"输华樱桃果园、设施审核批准注册"]
[null,"输华樱桃果园内不得种植其他植物。"]
[null,"输华樱桃必须来自苹果蠹蛾的非疫生产点（PFPSs）并采取有效的预防控制措施，非疫生产点的建立应遵循ISPM10的原则。"]
[null,"培训技术人员"]
[null,"施良好农业规范（GAP）、执行有害生物综合防治（IPM）"]
[null,"果园监控：对苹果蠹蛾的监测调查从盛花期开始，一直到樱桃的包装工作结束。"]
[null,"果园监控：对苹果蠹蛾的监测调查从盛花期开始，一直到樱桃的包装工作结束。"]
[null,"输华樱桃加工、包装、储藏和装运过程，须在乌方或乌方授权人员检疫监管下进行。"]
[null,"在加工、包装过程中，须对樱桃进行挑选、分拣和处理，以保证输华的樱桃不带有昆虫、螨类、烂果及枝、叶、根和土壤。"]
[null,"对输华樱桃要使用专门的包装线，不得同时包装其他水果，避免被有害生物污染。"]
[null,"包装好的樱桃应单独储藏，避免受有害生物再感染。樱桃包装箱上应用英文标出水果名称、产地（地区和万户（Tuman））、果园和包装厂及其注册号。每个出口托盘包装上应有经MAWR确认的检疫标识。每个包装箱和托盘需用中文标出“输往中华人民共和国”。\n樱桃包装材料应干净卫生、未使用过，符合中国有关植物检疫要求。"]
[null,"议定书实施的前两年，MAWR人员需按2%的抽样比例对输华樱桃实施出口检验检疫，最小取样量不得少于1200果，并对其中可疑果进行剖果检查。如果未发现检疫问题，此后抽样比例降低到1%，最小取样量不得少于600果。如果在出口检验检疫中，检出欧洲樱桃实蝇、葡萄花翅小卷蛾和苹果蠹蛾，MAWR将在本出口季节暂停该万户（Tuman）向中国出口，并通报AQSIQ。"]
[null,"对检验检疫合格的货物，MAWR应签发植物检疫证书，并在附加声明中注明“该批樱桃符合《乌兹别克斯坦樱桃输华植物检疫要求议定书》的规定，不带中方关注的检疫性有害生物”。\nMAWR在开展贸易前向AQSIQ提供植物检疫证书样本，以便确认备案。"]
[null,"对于实施出口前冷处理的樱桃，应在植物检疫证书上注明检疫处理方式、处理温度、持续时间及处理设施名称或编号等信息。对于实施运输途中冷处理的，应在植物检疫证书上标注“Cold treatment in transit”（途中冷处理），并注明冷处理的温度、处理时间、集装箱号码及封识号码等。"]
[null,"有关单证和标志进行核查，未经注册的果园、包装厂不准进境。如发现中方关注的任何检疫性有害生物，该批货物将作除害处理，退回或销毁处理。"]
[null,"本项目开始前，在MAWR协助下，AQSIQ将派至少两名植物检疫官员赴乌兹别克斯坦对樱桃有害生物监测体系和输华樱桃相关产区、果园、包装厂的植物卫生要求进行实地考察，并根据考察结果确认输华樱桃的产区、果园、包装厂名单。"]
[null,"在贸易过程中，AQSIQ将根据乌兹别克斯坦樱桃疫情发生动态及截获情况开展进一步的风险评估，并与MAWR协商，以适时调整检疫性有害生物名单及相应的检疫措施。为确保有关风险管理措施和操作要求的有效落实，AQSIQ和MAWR将按照相应的程序和规章对本议定书执行情况进行审核和评估。"]
[]
[]
[]
[]
[]
[]
[]
[]
[]
[]
[]
[]
[]
[]
[]
[]
[]
[]
[]
[]
[]
[]
[]
[]
[]
[]
[]
[]
[]
[]
[]
[]
[]
[]
[]
[]
[]
[]
[]
[null,"在DSSA中可以评估的最大措施数量 = 20。 "]
[null," 通过合并表B1中的相关措施并在表B2中重新选择它们来减少措施的数量。"]
[null," 例如，不要列出单个农药，而是将它们纳入一个术语，如“农药制度”，可在C部分中该措施的说明框中详细描述。"]
[]
[null,"建议的目标分类"]
[null,"指出有害生物挑战/侵染的程度"]
[null,"降低有害生物挑战"]
[null,"防止有害生物侵染"]
[null,"降低有害生物侵染"]
[null,"防止再次侵染"]
[null,"措施事实证明"]
[null,"验证实施效果"]
[null,"可追溯性"]

{"sheet":"Part C - Exporting","index":5,"n_rows":108,"n_cols":70,"rows_kept":108,"cut":false,"hidden":true,"merged":[[2,9,2,10],[6,0,6,7],[6,8,6,12],[6,41,6,45],[6,49,6,53],[7,2,7,4],[7,5,7,7],[8,2,8,4],[8,5,8,7],[10,8,10,9],[10,10,10,11],[11,8,11,9],[11,10,11,11],[12,8,12,9],[12,10,12,11],[13,8,13,9],[13,10,13,11],[14,8,14,9],[14,10,14,11],[15,8,15,9],[15,10,15,11],[16,8,16,9],[16,10,16,11],[17,8,17,9],[17,10,17,11],[18,8,18,9],[18,10,18,11],[19,8,19,9],[19,10,19,11],[20,8,20,9],[20,10,20,11],[21,8,21,9],[21,10,21,11],[22,8,22,9],[22,10,22,11],[23,8,23,9],[23,10,23,11],[24,8,24,9],[24,10,24,11],[25,8,25,9],[25,10,25,11],[26,8,26,9],[26,10,26,11],[27,8,27,9],[27,10,27,11],[28,8,28,9],[28,10,28,11],[29,8,29,9],[29,10,29,11],[31,0,31,13],[32,2,32,4],[32,5,32,7],[32,8,32,10],[32,11,32,13],[32,41,32,45],[32,49,32,53],[32,55,32,61],[32,65,32,69],[33,2,33,4],[33,5,33,7],[33,8,33,10],[33,11,33,13],[63,0,63,22],[64,1,64,2],[65,1,65,2],[66,1,66,2],[80,41,80,45],[81,0,81,6],[82,2,82,4],[84,5,84,6],[7,0,9,0],[32,0,33,0],[67,0,78,0],[7,1,9,1],[32,1,33,1],[67,1,68,1],[69,1,70,1],[71,1,72,1],[73,1,74,1],[75,1,76,1],[77,1,78,1],[7,12,9,12],[7,8,9,9],[7,10,9,11],[82,5,83,6]]}
[null,{"$f":"Main!B1","v":"全球超越合规 — 系统方法决策支持（DSSA）"}]
[null,{"$f":"IF(OR(ISBLANK('Part A - Exporting'!D7),ISBLANK('Part A - Exporting'!D9),ISBLANK('Part A - Exporting'!D10),ISBLANK('Part A - Exporting'!D11)),\"C部分：制定系统方法的评价措施\",\"C部分：为开发从 \"&'Part A - Exporting'!D9&\" 到 \"&'Part A - Exporting'!D10&\"的\"&'Part A - Exporting'!D7&\" 贸易系统方法的措施评价-针对\"&'Part A - Exporting'!D11)","v":"C部分：制定系统方法的评价措施"}]
[null,"出口版本"]
[]
[]
[]
["表C1.措施指标（降低有害生物风险和实施标准）",null,null,null,null,null,null,null,"可选说明",null,null,null,null,null,null,null,null,null,null,null,null,null,null,null,null,null,null,null,null,null,null,null,null,null,null,null,null,null,null,null,null,{"$f":"C8","v":"对降低出口货物中侵染有害生物风险的贡献"},null,null,null,null,null,null,null,{"$f":"F8","v":"实施标准"}]
[null,"可用的系统方法措施（来自B部分）","对降低出口货物中侵染有害生物风险的贡献",null,null,"实施标准",null,null,"与其他措施的互动",null,"说明",null,"措施目标",null,null,null,null,null,null,null,null,null,null,null,null,null,null,null,null,null,null,null,null,null,null,null,null,null,null,null,null,{"$f":"AP9","v":"非常低\t"},{"$f":"AQ9","v":"低"},{"$f":"AR9","v":"中"},{"$f":"AS9","v":"高"},{"$f":"AT9","v":"非常高"},null,null,null,{"$f":"AX9","v":"非常低\t"},{"$f":"AY9","v":"低"},{"$f":"AZ9","v":"中"},{"$f":"BA9","v":"高"},{"$f":"BB9","v":"非常高"}]
[null,null,"该措施对降低有害生物风险的最大贡献是： ",null,null,"该措施实地实施标准是：",null,null,null,null,null,null,null,null,null,null,null,null,null,null,null,null,null,null,null,null,null,null,null,null,null,null,null,null,null,null,null,null,null,null,null,{"$f":"AP10","v":"非常低\t"},{"$f":"AQ10","v":"低"},"中","高","非常高",null,null,null,{"$f":"AX10","v":"非常低\t"},{"$f":"AY10","v":"低"},{"$f":"AZ10","v":"中"},{"$f":"BA10","v":"高"},{"$f":"BB10","v":"非常高"}]
[null,null,"评分","不确定性","图表","评分","不确定性","图表",null,null,null,null,null,null,null,null,null,null,null,null,null,null,null,null,null,null,null,null,null,null,null,null,null,null,null,null,null,null,null,"评分","不确定性",{"$f":"A98","v":"非常低\t"},{"$f":"A99","v":"低"},{"$f":"A100","v":"中"},{"$f":"A101","v":"高"},{"$f":"A102","v":"非常高"},null,"评分","不确定性",{"$f":"A98","v":"非常低\t"},{"$f":"A99","v":"低"},{"$f":"A100","v":"中"},{"$f":"A101","v":"高"},{"$f":"A102","v":"非常高"}]
["i",{"$f":"IF('Part B - Exporting'!B52=0,\"\",'Part B - Exporting'!B52)","v":""},null,null,null,null,null,null,null,null,null,null,{"$f":"IF('Part B - Exporting'!C52=0,\"\",'Part B - Exporting'!C52)","v":""},null,null,null,null,null,null,null,null,null,null,null,null,null,null,null,null,null,null,null,null,null,null,null,null,null,1,{"$f":"IF(C11=$A$98,1,IF(C11=$A$99,2,IF(C11=$A$100,3,IF(C11=$A$101,4,IF(C11=$A$102,5,\"\")))))","v":""},{"$f":"IF(D11=$B$98,1,IF(D11=$B$99,2,IF(D11=$B$100,3,IF(D11=$B$101,4,\"\"))))","v":""},{"$f":"IF(OR($AN11=\"\",$AO11=\"\"),\"\",INDEX('Uncertainy tables (Beta)'!$G$7:$J$31,(($AN11-1)*5)+1,$AO11))","v":""},{"$f":"IF(OR($AN11=\"\",$AO11=\"\"),\"\",INDEX('Uncertainy tables (Beta)'!$G$7:$J$31,(($AN11-1)*5)+2,$AO11))","v":""},{"$f":"IF(OR($AN11=\"\",$AO11=\"\"),\"\",INDEX('Uncertainy tables (Beta)'!$G$7:$J$31,(($AN11-1)*5)+3,$AO11))","v":""},{"$f":"IF(OR($AN11=\"\",$AO11=\"\"),\"\",INDEX('Uncertainy tables (Beta)'!$G$7:$J$31,(($AN11-1)*5)+4,$AO11))","v":""},{"$f":"IF(OR($AN11=\"\",$AO11=\"\"),\"\",INDEX('Uncertainy tables (Beta)'!$G$7:$J$31,(($AN11-1)*5)+5,$AO11))","v":""},null,{"$f":"IF(F11=$A$98,1,IF(F11=$A$99,2,IF(F11=$A$100,3,IF(F11=$A$101,4,IF(F11=$A$102,5,\"\")))))","v":""},{"$f":"IF(G11=$B$98,1,IF(G11=$B$99,2,IF(G11=$B$100,3,IF(G11=$B$101,4,\"\"))))","v":""},{"$f":"IF(OR($AV11=\"\",$AW11=\"\"),\"\",INDEX('Uncertainy tables (Beta)'!$G$7:$J$31,(($AV11-1)*5)+1,$AW11))","v":""},{"$f":"IF(OR($AV11=\"\",$AW11=\"\"),\"\",INDEX('Uncertainy tables (Beta)'!$G$7:$J$31,(($AV11-1)*5)+2,$AW11))","v":""},{"$f":"IF(OR($AV11=\"\",$AW11=\"\"),\"\",INDEX('Uncertainy tables (Beta)'!$G$7:$J$31,(($AV11-1)*5)+3,$AW11))","v":""},{"$f":"IF(OR($AV11=\"\",$AW11=\"\"),\"\",INDEX('Uncertainy tables (Beta)'!$G$7:$J$31,(($AV11-1)*5)+4,$AW11))","v":""},{"$f":"IF(OR($AV11=\"\",$AW11=\"\"),\"\",INDEX('Uncertainy tables (Beta)'!$G$7:$J$31,(($AV11-1)*5)+5,$AW11))","v":""}]
["ii",{"$f":"IF('Part B - Exporting'!B53=0,\"\",'Part B - Exporting'!B53)","v":""},null,null,null,null,null,null,null,null,null,null,{"$f":"IF('Part B - Exporting'!C53=0,\"\",'Part B - Exporting'!C53)","v":""},null,null,null,null,null,null,null,null,null,null,null,null,null,null,null,null,null,null,null,null,null,null,null,null,null,{"$f":"AM11+1","v":2},{"$f":"IF(C12=$A$98,1,IF(C12=$A$99,2,IF(C12=$A$100,3,IF(C12=$A$101,4,IF(C12=$A$102,5,\"\")))))","v":""},"",{"$f":"IF(OR($AN12=\"\",$AO12=\"\"),\"\",INDEX('Uncertainy tables (Beta)'!$G$7:$J$31,(($AN12-1)*5)+1,$AO12))","v":""},{"$f":"IF(OR($AN12=\"\",$AO12=\"\"),\"\",INDEX('Uncertainy tables (Beta)'!$G$7:$J$31,(($AN12-1)*5)+2,$AO12))","v":""},{"$f":"IF(OR($AN12=\"\",$AO12=\"\"),\"\",INDEX('Uncertainy tables (Beta)'!$G$7:$J$31,(($AN12-1)*5)+3,$AO12))","v":""},{"$f":"IF(OR($AN12=\"\",$AO12=\"\"),\"\",INDEX('Uncertainy tables (Beta)'!$G$7:$J$31,(($AN12-1)*5)+4,$AO12))","v":""},{"$f":"IF(OR($AN12=\"\",$AO12=\"\"),\"\",INDEX('Uncertainy tables (Beta)'!$G$7:$J$31,(($AN12-1)*5)+5,$AO12))","v":""},null,"","",{"$f":"IF(OR($AV12=\"\",$AW12=\"\"),\"\",INDEX('Uncertainy tables (Beta)'!$G$7:$J$31,(($AV12-1)*5)+1,$AW12))","v":""},{"$f":"IF(OR($AV12=\"\",$AW12=\"\"),\"\",INDEX('Uncertainy tables (Beta)'!$G$7:$J$31,(($AV12-1)*5)+2,$AW12))","v":""},{"$f":"IF(OR($AV12=\"\",$AW12=\"\"),\"\",INDEX('Uncertainy tables (Beta)'!$G$7:$J$31,(($AV12-1)*5)+3,$AW12))","v":""},{"$f":"IF(OR($AV12=\"\",$AW12=\"\"),\"\",INDEX('Uncertainy tables (Beta)'!$G$7:$J$31,(($AV12-1)*5)+4,$AW12))","v":""},{"$f":"IF(OR($AV12=\"\",$AW12=\"\"),\"\",INDEX('Uncertainy tables (Beta)'!$G$7:$J$31,(($AV12-1)*5)+5,$AW12))","v":""}]
["iii",{"$f":"IF('Part B - Exporting'!B54=0,\"\",'Part B - Exporting'!B54)","v":""},null,null,null,null,null,null,null,null,null,null,{"$f":"IF('Part B - Exporting'!C54=0,\"\",'Part B - Exporting'!C54)","v":""},null,null,null,null,null,null,null,null,null,null,null,null,null,null,null,null,null,null,null,null,null,null,null,null,null,{"$f":"AM12+1","v":3},"","",{"$f":"IF(OR($AN13=\"\",$AO13=\"\"),\"\",INDEX('Uncertainy tables (Beta)'!$G$7:$J$31,(($AN13-1)*5)+1,$AO13))","v":""},{"$f":"IF(OR($AN13=\"\",$AO13=\"\"),\"\",INDEX('Uncertainy tables (Beta)'!$G$7:$J$31,(($AN13-1)*5)+2,$AO13))","v":""},{"$f":"IF(OR($AN13=\"\",$AO13=\"\"),\"\",INDEX('Uncertainy tables (Beta)'!$G$7:$J$31,(($AN13-1)*5)+3,$AO13))","v":""},{"$f":"IF(OR($AN13=\"\",$AO13=\"\"),\"\",INDEX('Uncertainy tables (Beta)'!$G$7:$J$31,(($AN13-1)*5)+4,$AO13))","v":""},{"$f":"IF(OR($AN13=\"\",$AO13=\"\"),\"\",INDEX('Uncertainy tables (Beta)'!$G$7:$J$31,(($AN13-1)*5)+5,$AO13))","v":""},null,"","",{"$f":"IF(OR($AV13=\"\",$AW13=\"\"),\"\",INDEX('Uncertainy tables (Beta)'!$G$7:$J$31,(($AV13-1)*5)+1,$AW13))","v":""},{"$f":"IF(OR($AV13=\"\",$AW13=\"\"),\"\",INDEX('Uncertainy tables (Beta)'!$G$7:$J$31,(($AV13-1)*5)+2,$AW13))","v":""},{"$f":"IF(OR($AV13=\"\",$AW13=\"\"),\"\",INDEX('Uncertainy tables (Beta)'!$G$7:$J$31,(($AV13-1)*5)+3,$AW13))","v":""},{"$f":"IF(OR($AV13=\"\",$AW13=\"\"),\"\",INDEX('Uncertainy tables (Beta)'!$G$7:$J$31,(($AV13-1)*5)+4,$AW13))","v":""},{"$f":"IF(OR($AV13=\"\",$AW13=\"\"),\"\",INDEX('Uncertainy tables (Beta)'!$G$7:$J$31,(($AV13-1)*5)+5,$AW13))","v":""}]
["iv",{"$f":"IF('Part B - Exporting'!B55=0,\"\",'Part B - Exporting'!B55)","v":""},null,null,null,null,null,null,null,null,null,null,{"$f":"IF('Part B - Exporting'!C55=0,\"\",'Part B - Exporting'!C55)","v":""},null,null,null,null,null,null,null,null,null,null,null,null,null,null,null,null,null,null,null,null,null,null,null,null,null,4,"","",{"$f":"IF(OR($AN14=\"\",$AO14=\"\"),\"\",INDEX('Uncertainy tables (Beta)'!$G$7:$J$31,(($AN14-1)*5)+1,$AO14))","v":""},{"$f":"IF(OR($AN14=\"\",$AO14=\"\"),\"\",INDEX('Uncertainy tables (Beta)'!$G$7:$J$31,(($AN14-1)*5)+2,$AO14))","v":""},{"$f":"IF(OR($AN14=\"\",$AO14=\"\"),\"\",INDEX('Uncertainy tables (Beta)'!$G$7:$J$31,(($AN14-1)*5)+3,$AO14))","v":""},{"$f":"IF(OR($AN14=\"\",$AO14=\"\"),\"\",INDEX('Uncertainy tables (Beta)'!$G$7:$J$31,(($AN14-1)*5)+4,$AO14))","v":""},{"$f":"IF(OR($AN14=\"\",$AO14=\"\"),\"\",INDEX('Uncertainy tables (Beta)'!$G$7:$J$31,(($AN14-1)*5)+5,$AO14))","v":""},null,"","",{"$f":"IF(OR($AV14=\"\",$AW14=\"\"),\"\",INDEX('Uncertainy tables (Beta)'!$G$7:$J$31,(($AV14-1)*5)+1,$AW14))","v":""},{"$f":"IF(OR($AV14=\"\",$AW14=\"\"),\"\",INDEX('Uncertainy tables (Beta)'!$G$7:$J$31,(($AV14-1)*5)+2,$AW14))","v":""},{"$f":"IF(OR($AV14=\"\",$AW14=\"\"),\"\",INDEX('Uncertainy tables (Beta)'!$G$7:$J$31,(($AV14-1)*5)+3,$AW14))","v":""},{"$f":"IF(OR($AV14=\"\",$AW14=\"\"),\"\",INDEX('Uncertainy tables (Beta)'!$G$7:$J$31,(($AV14-1)*5)+4,$AW14))","v":""},{"$f":"IF(OR($AV14=\"\",$AW14=\"\"),\"\",INDEX('Uncertainy tables (Beta)'!$G$7:$J$31,(($AV14-1)*5)+5,$AW14))","v":""}]
["v",{"$f":"IF('Part B - Exporting'!B56=0,\"\",'Part B - Exporting'!B56)","v":""},null,null,null,null,null,null,null,null,null,null,{"$f":"IF('Part B - Exporting'!C56=0,\"\",'Part B - Exporting'!C56)","v":""},null,null,null,null,null,null,null,null,null,null,null,null,null,null,null,null,null,null,null,null,null,null,null,null,null,5,"","",{"$f":"IF(OR($AN15=\"\",$AO15=\"\"),\"\",INDEX('Uncertainy tables (Beta)'!$G$7:$J$31,(($AN15-1)*5)+1,$AO15))","v":""},{"$f":"IF(OR($AN15=\"\",$AO15=\"\"),\"\",INDEX('Uncertainy tables (Beta)'!$G$7:$J$31,(($AN15-1)*5)+2,$AO15))","v":""},{"$f":"IF(OR($AN15=\"\",$AO15=\"\"),\"\",INDEX('Uncertainy tables (Beta)'!$G$7:$J$31,(($AN15-1)*5)+3,$AO15))","v":""},{"$f":"IF(OR($AN15=\"\",$AO15=\"\"),\"\",INDEX('Uncertainy tables (Beta)'!$G$7:$J$31,(($AN15-1)*5)+4,$AO15))","v":""},{"$f":"IF(OR($AN15=\"\",$AO15=\"\"),\"\",INDEX('Uncertainy tables (Beta)'!$G$7:$J$31,(($AN15-1)*5)+5,$AO15))","v":""},null,"","",{"$f":"IF(OR($AV15=\"\",$AW15=\"\"),\"\",INDEX('Uncertainy tables (Beta)'!$G$7:$J$31,(($AV15-1)*5)+1,$AW15))","v":""},{"$f":"IF(OR($AV15=\"\",$AW15=\"\"),\"\",INDEX('Uncertainy tables (Beta)'!$G$7:$J$31,(($AV15-1)*5)+2,$AW15))","v":""},{"$f":"IF(OR($AV15=\"\",$AW15=\"\"),\"\",INDEX('Uncertainy tables (Beta)'!$G$7:$J$31,(($AV15-1)*5)+3,$AW15))","v":""},{"$f":"IF(OR($AV15=\"\",$AW15=\"\"),\"\",INDEX('Uncertainy tables (Beta)'!$G$7:$J$31,(($AV15-1)*5)+4,$AW15))","v":""},{"$f":"IF(OR($AV15=\"\",$AW15=\"\"),\"\",INDEX('Uncertainy tables (Beta)'!$G$7:$J$31,(($AV15-1)*5)+5,$AW15))","v":""}]
["vi",{"$f":"IF('Part B - Exporting'!B57=0,\"\",'Part B - Exporting'!B57)","v":""},null,null,null,null,null,null,null,null,null,null,{"$f":"IF('Part B - Exporting'!C57=0,\"\",'Part B - Exporting'!C57)","v":""},null,null,null,null,null,null,null,null,null,null,null,null,null,null,null,null,null,null,null,null,null,null,null,null,null,6,"","",{"$f":"IF(OR($AN16=\"\",$AO16=\"\"),\"\",INDEX('Uncertainy tables (Beta)'!$G$7:$J$31,(($AN16-1)*5)+1,$AO16))","v":""},{"$f":"IF(OR($AN16=\"\",$AO16=\"\"),\"\",INDEX('Uncertainy tables (Beta)'!$G$7:$J$31,(($AN16-1)*5)+2,$AO16))","v":""},{"$f":"IF(OR($AN16=\"\",$AO16=\"\"),\"\",INDEX('Uncertainy tables (Beta)'!$G$7:$J$31,(($AN16-1)*5)+3,$AO16))","v":""},{"$f":"IF(OR($AN16=\"\",$AO16=\"\"),\"\",INDEX('Uncertainy tables (Beta)'!$G$7:$J$31,(($AN16-1)*5)+4,$AO16))","v":""},{"$f":"IF(OR($AN16=\"\",$AO16=\"\"),\"\",INDEX('Uncertainy tables (Beta)'!$G$7:$J$31,(($AN16-1)*5)+5,$AO16))","v":""},null,"","",{"$f":"IF(OR($AV16=\"\",$AW16=\"\"),\"\",INDEX('Uncertainy tables (Beta)'!$G$7:$J$31,(($AV16-1)*5)+1,$AW16))","v":""},{"$f":"IF(OR($AV16=\"\",$AW16=\"\"),\"\",INDEX('Uncertainy tables (Beta)'!$G$7:$J$31,(($AV16-1)*5)+2,$AW16))","v":""},{"$f":"IF(OR($AV16=\"\",$AW16=\"\"),\"\",INDEX('Uncertainy tables (Beta)'!$G$7:$J$31,(($AV16-1)*5)+3,$AW16))","v":""},{"$f":"IF(OR($AV16=\"\",$AW16=\"\"),\"\",INDEX('Uncertainy tables (Beta)'!$G$7:$J$31,(($AV16-1)*5)+4,$AW16))","v":""},{"$f":"IF(OR($AV16=\"\",$AW16=\"\"),\"\",INDEX('Uncertainy tables (Beta)'!$G$7:$J$31,(($AV16-1)*5)+5,$AW16))","v":""}]
["vii",{"$f":"IF('Part B - Exporting'!B58=0,\"\",'Part B - Exporting'!B58)","v":""},null,null,null,null,null,null,null,null,null,null,{"$f":"IF('Part B - Exporting'!C58=0,\"\",'Part B - Exporting'!C58)","v":""},null,null,null,null,null,null,null,null,null,null,null,null,null,null,null,null,null,null,null,null,null,null,null,null,null,7,"","",{"$f":"IF(OR($AN17=\"\",$AO17=\"\"),\"\",INDEX('Uncertainy tables (Beta)'!$G$7:$J$31,(($AN17-1)*5)+1,$AO17))","v":""},{"$f":"IF(OR($AN17=\"\",$AO17=\"\"),\"\",INDEX('Uncertainy tables (Beta)'!$G$7:$J$31,(($AN17-1)*5)+2,$AO17))","v":""},{"$f":"IF(OR($AN17=\"\",$AO17=\"\"),\"\",INDEX('Uncertainy tables (Beta)'!$G$7:$J$31,(($AN17-1)*5)+3,$AO17))","v":""},{"$f":"IF(OR($AN17=\"\",$AO17=\"\"),\"\",INDEX('Uncertainy tables (Beta)'!$G$7:$J$31,(($AN17-1)*5)+4,$AO17))","v":""},{"$f":"IF(OR($AN17=\"\",$AO17=\"\"),\"\",INDEX('Uncertainy tables (Beta)'!$G$7:$J$31,(($AN17-1)*5)+5,$AO17))","v":""},null,"","",{"$f":"IF(OR($AV17=\"\",$AW17=\"\"),\"\",INDEX('Uncertainy tables (Beta)'!$G$7:$J$31,(($AV17-1)*5)+1,$AW17))","v":""},{"$f":"IF(OR($AV17=\"\",$AW17=\"\"),\"\",INDEX('Uncertainy tables (Beta)'!$G$7:$J$31,(($AV17-1)*5)+2,$AW17))","v":""},{"$f":"IF(OR($AV17=\"\",$AW17=\"\"),\"\",INDEX('Uncertainy tables (Beta)'!$G$7:$J$31,(($AV17-1)*5)+3,$AW17))","v":""},{"$f":"IF(OR($AV17=\"\",$AW17=\"\"),\"\",INDEX('Uncertainy tables (Beta)'!$G$7:$J$31,(($AV17-1)*5)+4,$AW17))","v":""},{"$f":"IF(OR($AV17=\"\",$AW17=\"\"),\"\",INDEX('Uncertainy tables (Beta)'!$G$7:$J$31,(($AV17-1)*5)+5,$AW17))","v":""}]
["viii",{"$f":"IF('Part B - Exporting'!B59=0,\"\",'Part B - Exporting'!B59)","v":""},null,null,null,null,null,null,null,null,null,null,{"$f":"IF('Part B - Exporting'!C59=0,\"\",'Part B - Exporting'!C59)","v":""},null,null,null,null,null,null,null,null,null,null,null,null,null,null,null,null,null,null,null,null,null,null,null,null,null,8,"","",{"$f":"IF(OR($AN18=\"\",$AO18=\"\"),\"\",INDEX('Uncertainy tables (Beta)'!$G$7:$J$31,(($AN18-1)*5)+1,$AO18))","v":""},{"$f":"IF(OR($AN18=\"\",$AO18=\"\"),\"\",INDEX('Uncertainy tables (Beta)'!$G$7:$J$31,(($AN18-1)*5)+2,$AO18))","v":""},{"$f":"IF(OR($AN18=\"\",$AO18=\"\"),\"\",INDEX('Uncertainy tables (Beta)'!$G$7:$J$31,(($AN18-1)*5)+3,$AO18))","v":""},{"$f":"IF(OR($AN18=\"\",$AO18=\"\"),\"\",INDEX('Uncertainy tables (Beta)'!$G$7:$J$31,(($AN18-1)*5)+4,$AO18))","v":""},{"$f":"IF(OR($AN18=\"\",$AO18=\"\"),\"\",INDEX('Uncertainy tables (Beta)'!$G$7:$J$31,(($AN18-1)*5)+5,$AO18))","v":""},null,"","",{"$f":"IF(OR($AV18=\"\",$AW18=\"\"),\"\",INDEX('Uncertainy tables (Beta)'!$G$7:$J$31,(($AV18-1)*5)+1,$AW18))","v":""},{"$f":"IF(OR($AV18=\"\",$AW18=\"\"),\"\",INDEX('Uncertainy tables (Beta)'!$G$7:$J$31,(($AV18-1)*5)+2,$AW18))","v":""},{"$f":"IF(OR($AV18=\"\",$AW18=\"\"),\"\",INDEX('Uncertainy tables (Beta)'!$G$7:$J$31,(($AV18-1)*5)+3,$AW18))","v":""},{"$f":"IF(OR($AV18=\"\",$AW18=\"\"),\"\",INDEX('Uncertainy tables (Beta)'!$G$7:$J$31,(($AV18-1)*5)+4,$AW18))","v":""},{"$f":"IF(OR($AV18=\"\",$AW18=\"\"),\"\",INDEX('Uncertainy tables (Beta)'!$G$7:$J$31,(($AV18-1)*5)+5,$AW18))","v":""}]
["ix",{"$f":"IF('Part B - Exporting'!B60=0,\"\",'Part B - Exporting'!B60)","v":""},null,null,null,null,null,null,null,null,null,null,{"$f":"IF('Part B - Exporting'!C60=0,\"\",'Part B - Exporting'!C60)","v":""},null,null,null,null,null,null,null,null,null,null,null,null,null,null,null,null,null,null,null,null,null,null,null,null,null,9,"","",{"$f":"IF(OR($AN19=\"\",$AO19=\"\"),\"\",INDEX('Uncertainy tables (Beta)'!$G$7:$J$31,(($AN19-1)*5)+1,$AO19))","v":""},{"$f":"IF(OR($AN19=\"\",$AO19=\"\"),\"\",INDEX('Uncertainy tables (Beta)'!$G$7:$J$31,(($AN19-1)*5)+2,$AO19))","v":""},{"$f":"IF(OR($AN19=\"\",$AO19=\"\"),\"\",INDEX('Uncertainy tables (Beta)'!$G$7:$J$31,(($AN19-1)*5)+3,$AO19))","v":""},{"$f":"IF(OR($AN19=\"\",$AO19=\"\"),\"\",INDEX('Uncertainy tables (Beta)'!$G$7:$J$31,(($AN19-1)*5)+4,$AO19))","v":""},{"$f":"IF(OR($AN19=\"\",$AO19=\"\"),\"\",INDEX('Uncertainy tables (Beta)'!$G$7:$J$31,(($AN19-1)*5)+5,$AO19))","v":""},null,"","",{"$f":"IF(OR($AV19=\"\",$AW19=\"\"),\"\",INDEX('Uncertainy tables (Beta)'!$G$7:$J$31,(($AV19-1)*5)+1,$AW19))","v":""},{"$f":"IF(OR($AV19=\"\",$AW19=\"\"),\"\",INDEX('Uncertainy tables (Beta)'!$G$7:$J$31,(($AV19-1)*5)+2,$AW19))","v":""},{"$f":"IF(OR($AV19=\"\",$AW19=\"\"),\"\",INDEX('Uncertainy tables (Beta)'!$G$7:$J$31,(($AV19-1)*5)+3,$AW19))","v":""},{"$f":"IF(OR($AV19=\"\",$AW19=\"\"),\"\",INDEX('Uncertainy tables (Beta)'!$G$7:$J$31,(($AV19-1)*5)+4,$AW19))","v":""},{"$f":"IF(OR($AV19=\"\",$AW19=\"\"),\"\",INDEX('Uncertainy tables (Beta)'!$G$7:$J$31,(($AV19-1)*5)+5,$AW19))","v":""}]
["x",{"$f":"IF('Part B - Exporting'!B61=0,\"\",'Part B - Exporting'!B61)","v":""},null,null,null,null,null,null,null,null,null,null,{"$f":"IF('Part B - Exporting'!C61=0,\"\",'Part B - Exporting'!C61)","v":""},null,null,null,null,null,null,null,null,null,null,null,null,null,null,null,null,null,null,null,null,null,null,null,null,null,10,"","",{"$f":"IF(OR($AN20=\"\",$AO20=\"\"),\"\",INDEX('Uncertainy tables (Beta)'!$G$7:$J$31,(($AN20-1)*5)+1,$AO20))","v":""},{"$f":"IF(OR($AN20=\"\",$AO20=\"\"),\"\",INDEX('Uncertainy tables (Beta)'!$G$7:$J$31,(($AN20-1)*5)+2,$AO20))","v":""},{"$f":"IF(OR($AN20=\"\",$AO20=\"\"),\"\",INDEX('Uncertainy tables (Beta)'!$G$7:$J$31,(($AN20-1)*5)+3,$AO20))","v":""},{"$f":"IF(OR($AN20=\"\",$AO20=\"\"),\"\",INDEX('Uncertainy tables (Beta)'!$G$7:$J$31,(($AN20-1)*5)+4,$AO20))","v":""},{"$f":"IF(OR($AN20=\"\",$AO20=\"\"),\"\",INDEX('Uncertainy tables (Beta)'!$G$7:$J$31,(($AN20-1)*5)+5,$AO20))","v":""},null,"","",{"$f":"IF(OR($AV20=\"\",$AW20=\"\"),\"\",INDEX('Uncertainy tables (Beta)'!$G$7:$J$31,(($AV20-1)*5)+1,$AW20))","v":""},{"$f":"IF(OR($AV20=\"\",$AW20=\"\"),\"\",INDEX('Uncertainy tables (Beta)'!$G$7:$J$31,(($AV20-1)*5)+2,$AW20))","v":""},{"$f":"IF(OR($AV20=\"\",$AW20=\"\"),\"\",INDEX('Uncertainy tables (Beta)'!$G$7:$J$31,(($AV20-1)*5)+3,$AW20))","v":""},{"$f":"IF(OR($AV20=\"\",$AW20=\"\"),\"\",INDEX('Uncertainy tables (Beta)'!$G$7:$J$31,(($AV20-1)*5)+4,$AW20))","v":""},{"$f":"IF(OR($AV20=\"\",$AW20=\"\"),\"\",INDEX('Uncertainy tables (Beta)'!$G$7:$J$31,(($AV20-1)*5)+5,$AW20))","v":""}]
["xi",{"$f":"IF('Part B - Exporting'!B62=0,\"\",'Part B - Exporting'!B62)","v":""},null,null,null,null,null,null,null,null,null,null,{"$f":"IF('Part B - Exporting'!C62=0,\"\",'Part B - Exporting'!C62)","v":""},null,null,null,null,null,null,null,null,null,null,null,null,null,null,null,null,null,null,null,null,null,null,null,null,null,11,"","",{"$f":"IF(OR($AN21=\"\",$AO21=\"\"),\"\",INDEX('Uncertainy tables (Beta)'!$G$7:$J$31,(($AN21-1)*5)+1,$AO21))","v":""},{"$f":"IF(OR($AN21=\"\",$AO21=\"\"),\"\",INDEX('Uncertainy tables (Beta)'!$G$7:$J$31,(($AN21-1)*5)+2,$AO21))","v":""},{"$f":"IF(OR($AN21=\"\",$AO21=\"\"),\"\",INDEX('Uncertainy tables (Beta)'!$G$7:$J$31,(($AN21-1)*5)+3,$AO21))","v":""},{"$f":"IF(OR($AN21=\"\",$AO21=\"\"),\"\",INDEX('Uncertainy tables (Beta)'!$G$7:$J$31,(($AN21-1)*5)+4,$AO21))","v":""},{"$f":"IF(OR($AN21=\"\",$AO21=\"\"),\"\",INDEX('Uncertainy tables (Beta)'!$G$7:$J$31,(($AN21-1)*5)+5,$AO21))","v":""},null,"","",{"$f":"IF(OR($AV21=\"\",$AW21=\"\"),\"\",INDEX('Uncertainy tables (Beta)'!$G$7:$J$31,(($AV21-1)*5)+1,$AW21))","v":""},{"$f":"IF(OR($AV21=\"\",$AW21=\"\"),\"\",INDEX('Uncertainy tables (Beta)'!$G$7:$J$31,(($AV21-1)*5)+2,$AW21))","v":""},{"$f":"IF(OR($AV21=\"\",$AW21=\"\"),\"\",INDEX('Uncertainy tables (Beta)'!$G$7:$J$31,(($AV21-1)*5)+3,$AW21))","v":""},{"$f":"IF(OR($AV21=\"\",$AW21=\"\"),\"\",INDEX('Uncertainy tables (Beta)'!$G$7:$J$31,(($AV21-1)*5)+4,$AW21))","v":""},{"$f":"IF(OR($AV21=\"\",$AW21=\"\"),\"\",INDEX('Uncertainy tables (Beta)'!$G$7:$J$31,(($AV21-1)*5)+5,$AW21))","v":""}]
["xii",{"$f":"IF('Part B - Exporting'!B63=0,\"\",'Part B - Exporting'!B63)","v":""},null,null,null,null,null,null,null,null,null,null,{"$f":"IF('Part B - Exporting'!C63=0,\"\",'Part B - Exporting'!C63)","v":""},null,null,null,null,null,null,null,null,null,null,null,null,null,null,null,null,null,null,null,null,null,null,null,null,null,12,"","",{"$f":"IF(OR($AN22=\"\",$AO22=\"\"),\"\",INDEX('Uncertainy tables (Beta)'!$G$7:$J$31,(($AN22-1)*5)+1,$AO22))","v":""},{"$f":"IF(OR($AN22=\"\",$AO22=\"\"),\"\",INDEX('Uncertainy tables (Beta)'!$G$7:$J$31,(($AN22-1)*5)+2,$AO22))","v":""},{"$f":"IF(OR($AN22=\"\",$AO22=\"\"),\"\",INDEX('Uncertainy tables (Beta)'!$G$7:$J$31,(($AN22-1)*5)+3,$AO22))","v":""},{"$f":"IF(OR($AN22=\"\",$AO22=\"\"),\"\",INDEX('Uncertainy tables (Beta)'!$G$7:$J$31,(($AN22-1)*5)+4,$AO22))","v":""},{"$f":"IF(OR($AN22=\"\",$AO22=\"\"),\"\",INDEX('Uncertainy tables (Beta)'!$G$7:$J$31,(($AN22-1)*5)+5,$AO22))","v":""},null,"","",{"$f":"IF(OR($AV22=\"\",$AW22=\"\"),\"\",INDEX('Uncertainy tables (Beta)'!$G$7:$J$31,(($AV22-1)*5)+1,$AW22))","v":""},{"$f":"IF(OR($AV22=\"\",$AW22=\"\"),\"\",INDEX('Uncertainy tables (Beta)'!$G$7:$J$31,(($AV22-1)*5)+2,$AW22))","v":""},{"$f":"IF(OR($AV22=\"\",$AW22=\"\"),\"\",INDEX('Uncertainy tables (Beta)'!$G$7:$J$31,(($AV22-1)*5)+3,$AW22))","v":""},{"$f":"IF(OR($AV22=\"\",$AW22=\"\"),\"\",INDEX('Uncertainy tables (Beta)'!$G$7:$J$31,(($AV22-1)*5)+4,$AW22))","v":""},{"$f":"IF(OR($AV22=\"\",$AW22=\"\"),\"\",INDEX('Uncertainy tables (Beta)'!$G$7:$J$31,(($AV22-1)*5)+5,$AW22))","v":""}]
["xiii",{"$f":"IF('Part B - Exporting'!B64=0,\"\",'Part B - Exporting'!B64)","v":""},null,null,null,null,null,null,null,null,null,null,{"$f":"IF('Part B - Exporting'!C64=0,\"\",'Part B - Exporting'!C64)","v":""},null,null,null,null,null,null,null,null,null,null,null,null,null,null,null,null,null,null,null,null,null,null,null,null,null,13,"","",{"$f":"IF(OR($AN23=\"\",$AO23=\"\"),\"\",INDEX('Uncertainy tables (Beta)'!$G$7:$J$31,(($AN23-1)*5)+1,$AO23))","v":""},{"$f":"IF(OR($AN23=\"\",$AO23=\"\"),\"\",INDEX('Uncertainy tables (Beta)'!$G$7:$J$31,(($AN23-1)*5)+2,$AO23))","v":""},{"$f":"IF(OR($AN23=\"\",$AO23=\"\"),\"\",INDEX('Uncertainy tables (Beta)'!$G$7:$J$31,(($AN23-1)*5)+3,$AO23))","v":""},{"$f":"IF(OR($AN23=\"\",$AO23=\"\"),\"\",INDEX('Uncertainy tables (Beta)'!$G$7:$J$31,(($AN23-1)*5)+4,$AO23))","v":""},{"$f":"IF(OR($AN23=\"\",$AO23=\"\"),\"\",INDEX('Uncertainy tables (Beta)'!$G$7:$J$31,(($AN23-1)*5)+5,$AO23))","v":""},null,"","",{"$f":"IF(OR($AV23=\"\",$AW23=\"\"),\"\",INDEX('Uncertainy tables (Beta)'!$G$7:$J$31,(($AV23-1)*5)+1,$AW23))","v":""},{"$f":"IF(OR($AV23=\"\",$AW23=\"\"),\"\",INDEX('Uncertainy tables (Beta)'!$G$7:$J$31,(($AV23-1)*5)+2,$AW23))","v":""},{"$f":"IF(OR($AV23=\"\",$AW23=\"\"),\"\",INDEX('Uncertainy tables (Beta)'!$G$7:$J$31,(($AV23-1)*5)+3,$AW23))","v":""},{"$f":"IF(OR($AV23=\"\",$AW23=\"\"),\"\",INDEX('Uncertainy tables (Beta)'!$G$7:$J$31,(($AV23-1)*5)+4,$AW23))","v":""},{"$f":"IF(OR($AV23=\"\",$AW23=\"\"),\"\",INDEX('Uncertainy tables (Beta)'!$G$7:$J$31,(($AV23-1)*5)+5,$AW23))","v":""}]
["xiv",{"$f":"IF('Part B - Exporting'!B65=0,\"\",'Part B - Exporting'!B65)","v":""},null,null,null,null,null,null,null,null,null,null,{"$f":"IF('Part B - Exporting'!C65=0,\"\",'Part B - Exporting'!C65)","v":""},null,null,null,null,null,null,null,null,null,null,null,null,null,null,null,null,null,null,null,null,null,null,null,null,null,14,"","",{"$f":"IF(OR($AN24=\"\",$AO24=\"\"),\"\",INDEX('Uncertainy tables (Beta)'!$G$7:$J$31,(($AN24-1)*5)+1,$AO24))","v":""},{"$f":"IF(OR($AN24=\"\",$AO24=\"\"),\"\",INDEX('Uncertainy tables (Beta)'!$G$7:$J$31,(($AN24-1)*5)+2,$AO24))","v":""},{"$f":"IF(OR($AN24=\"\",$AO24=\"\"),\"\",INDEX('Uncertainy tables (Beta)'!$G$7:$J$31,(($AN24-1)*5)+3,$AO24))","v":""},{"$f":"IF(OR($AN24=\"\",$AO24=\"\"),\"\",INDEX('Uncertainy tables (Beta)'!$G$7:$J$31,(($AN24-1)*5)+4,$AO24))","v":""},{"$f":"IF(OR($AN24=\"\",$AO24=\"\"),\"\",INDEX('Uncertainy tables (Beta)'!$G$7:$J$31,(($AN24-1)*5)+5,$AO24))","v":""},null,"","",{"$f":"IF(OR($AV24=\"\",$AW24=\"\"),\"\",INDEX('Uncertainy tables (Beta)'!$G$7:$J$31,(($AV24-1)*5)+1,$AW24))","v":""},{"$f":"IF(OR($AV24=\"\",$AW24=\"\"),\"\",INDEX('Uncertainy tables (Beta)'!$G$7:$J$31,(($AV24-1)*5)+2,$AW24))","v":""},{"$f":"IF(OR($AV24=\"\",$AW24=\"\"),\"\",INDEX('Uncertainy tables (Beta)'!$G$7:$J$31,(($AV24-1)*5)+3,$AW24))","v":""},{"$f":"IF(OR($AV24=\"\",$AW24=\"\"),\"\",INDEX('Uncertainy tables (Beta)'!$G$7:$J$31,(($AV24-1)*5)+4,$AW24))","v":""},{"$f":"IF(OR($AV24=\"\",$AW24=\"\"),\"\",INDEX('Uncertainy tables (Beta)'!$G$7:$J$31,(($AV24-1)*5)+5,$AW24))","v":""}]
["xv",{"$f":"IF('Part B - Exporting'!B66=0,\"\",'Part B - Exporting'!B66)","v":""},null,null,null,null,null,null,null,null,null,null,{"$f":"IF('Part B - Exporting'!C66=0,\"\",'Part B - Exporting'!C66)","v":""},null,null,null,null,null,null,null,null,null,null,null,null,null,null,null,null,null,null,null,null,null,null,null,null,null,15,"","",{"$f":"IF(OR($AN25=\"\",$AO25=\"\"),\"\",INDEX('Uncertainy tables (Beta)'!$G$7:$J$31,(($AN25-1)*5)+1,$AO25))","v":""},{"$f":"IF(OR($AN25=\"\",$AO25=\"\"),\"\",INDEX('Uncertainy tables (Beta)'!$G$7:$J$31,(($AN25-1)*5)+2,$AO25))","v":""},{"$f":"IF(OR($AN25=\"\",$AO25=\"\"),\"\",INDEX('Uncertainy tables (Beta)'!$G$7:$J$31,(($AN25-1)*5)+3,$AO25))","v":""},{"$f":"IF(OR($AN25=\"\",$AO25=\"\"),\"\",INDEX('Uncertainy tables (Beta)'!$G$7:$J$31,(($AN25-1)*5)+4,$AO25))","v":""},{"$f":"IF(OR($AN25=\"\",$AO25=\"\"),\"\",INDEX('Uncertainy tables (Beta)'!$G$7:$J$31,(($AN25-1)*5)+5,$AO25))","v":""},null,"","",{"$f":"IF(OR($AV25=\"\",$AW25=\"\"),\"\",INDEX('Uncertainy tables (Beta)'!$G$7:$J$31,(($AV25-1)*5)+1,$AW25))","v":""},{"$f":"IF(OR($AV25=\"\",$AW25=\"\"),\"\",INDEX('Uncertainy tables (Beta)'!$G$7:$J$31,(($AV25-1)*5)+2,$AW25))","v":""},{"$f":"IF(OR($AV25=\"\",$AW25=\"\"),\"\",INDEX('Uncertainy tables (Beta)'!$G$7:$J$31,(($AV25-1)*5)+3,$AW25))","v":""},{"$f":"IF(OR($AV25=\"\",$AW25=\"\"),\"\",INDEX('Uncertainy tables (Beta)'!$G$7:$J$31,(($AV25-1)*5)+4,$AW25))","v":""},{"$f":"IF(OR($AV25=\"\",$AW25=\"\"),\"\",INDEX('Uncertainy tables (Beta)'!$G$7:$J$31,(($AV25-1)*5)+5,$AW25))","v":""}]
["xvi",{"$f":"IF('Part B - Exporting'!B67=0,\"\",'Part B - Exporting'!B67)","v":""},null,null,null,null,null,null,null,null,null,null,{"$f":"IF('Part B - Exporting'!C67=0,\"\",'Part B - Exporting'!C67)","v":""},null,null,null,null,null,null,null,null,null,null,null,null,null,null,null,null,null,null,null,null,null,null,null,null,null,16,"","",{"$f":"IF(OR($AN26=\"\",$AO26=\"\"),\"\",INDEX('Uncertainy tables (Beta)'!$G$7:$J$31,(($AN26-1)*5)+1,$AO26))","v":""},{"$f":"IF(OR($AN26=\"\",$AO26=\"\"),\"\",INDEX('Uncertainy tables (Beta)'!$G$7:$J$31,(($AN26-1)*5)+2,$AO26))","v":""},{"$f":"IF(OR($AN26=\"\",$AO26=\"\"),\"\",INDEX('Uncertainy tables (Beta)'!$G$7:$J$31,(($AN26-1)*5)+3,$AO26))","v":""},{"$f":"IF(OR($AN26=\"\",$AO26=\"\"),\"\",INDEX('Uncertainy tables (Beta)'!$G$7:$J$31,(($AN26-1)*5)+4,$AO26))","v":""},{"$f":"IF(OR($AN26=\"\",$AO26=\"\"),\"\",INDEX('Uncertainy tables (Beta)'!$G$7:$J$31,(($AN26-1)*5)+5,$AO26))","v":""},null,"","",{"$f":"IF(OR($AV26=\"\",$AW26=\"\"),\"\",INDEX('Uncertainy tables (Beta)'!$G$7:$J$31,(($AV26-1)*5)+1,$AW26))","v":""},{"$f":"IF(OR($AV26=\"\",$AW26=\"\"),\"\",INDEX('Uncertainy tables (Beta)'!$G$7:$J$31,(($AV26-1)*5)+2,$AW26))","v":""},{"$f":"IF(OR($AV26=\"\",$AW26=\"\"),\"\",INDEX('Uncertainy tables (Beta)'!$G$7:$J$31,(($AV26-1)*5)+3,$AW26))","v":""},{"$f":"IF(OR($AV26=\"\",$AW26=\"\"),\"\",INDEX('Uncertainy tables (Beta)'!$G$7:$J$31,(($AV26-1)*5)+4,$AW26))","v":""},{"$f":"IF(OR($AV26=\"\",$AW26=\"\"),\"\",INDEX('Uncertainy tables (Beta)'!$G$7:$J$31,(($AV26-1)*5)+5,$AW26))","v":""}]
["xvii",{"$f":"IF('Part B - Exporting'!B68=0,\"\",'Part B - Exporting'!B68)","v":""},null,null,null,null,null,null,null,null,null,null,{"$f":"IF('Part B - Exporting'!C68=0,\"\",'Part B - Exporting'!C68)","v":""},null,null,null,null,null,null,null,null,null,null,null,null,null,null,null,null,null,null,null,null,null,null,null,null,null,17,"","",{"$f":"IF(OR($AN27=\"\",$AO27=\"\"),\"\",INDEX('Uncertainy tables (Beta)'!$G$7:$J$31,(($AN27-1)*5)+1,$AO27))","v":""},{"$f":"IF(OR($AN27=\"\",$AO27=\"\"),\"\",INDEX('Uncertainy tables (Beta)'!$G$7:$J$31,(($AN27-1)*5)+2,$AO27))","v":""},{"$f":"IF(OR($AN27=\"\",$AO27=\"\"),\"\",INDEX('Uncertainy tables (Beta)'!$G$7:$J$31,(($AN27-1)*5)+3,$AO27))","v":""},{"$f":"IF(OR($AN27=\"\",$AO27=\"\"),\"\",INDEX('Uncertainy tables (Beta)'!$G$7:$J$31,(($AN27-1)*5)+4,$AO27))","v":""},{"$f":"IF(OR($AN27=\"\",$AO27=\"\"),\"\",INDEX('Uncertainy tables (Beta)'!$G$7:$J$31,(($AN27-1)*5)+5,$AO27))","v":""},null,"","",{"$f":"IF(OR($AV27=\"\",$AW27=\"\"),\"\",INDEX('Uncertainy tables (Beta)'!$G$7:$J$31,(($AV27-1)*5)+1,$AW27))","v":""},{"$f":"IF(OR($AV27=\"\",$AW27=\"\"),\"\",INDEX('Uncertainy tables (Beta)'!$G$7:$J$31,(($AV27-1)*5)+2,$AW27))","v":""},{"$f":"IF(OR($AV27=\"\",$AW27=\"\"),\"\",INDEX('Uncertainy tables (Beta)'!$G$7:$J$31,(($AV27-1)*5)+3,$AW27))","v":""},{"$f":"IF(OR($AV27=\"\",$AW27=\"\"),\"\",INDEX('Uncertainy tables (Beta)'!$G$7:$J$31,(($AV27-1)*5)+4,$AW27))","v":""},{"$f":"IF(OR($AV27=\"\",$AW27=\"\"),\"\",INDEX('Uncertainy tables (Beta)'!$G$7:$J$31,(($AV27-1)*5)+5,$AW27))","v":""}]
["xviii",{"$f":"IF('Part B - Exporting'!B69=0,\"\",'Part B - Exporting'!B69)","v":""},null,null,null,null,null,null,null,null,null,null,{"$f":"IF('Part B - Exporting'!C69=0,\"\",'Part B - Exporting'!C69)","v":""},null,null,null,null,null,null,null,null,null,null,null,null,null,null,null,null,null,null,null,null,null,null,null,null,null,18,"","",{"$f":"IF(OR($AN28=\"\",$AO28=\"\"),\"\",INDEX('Uncertainy tables (Beta)'!$G$7:$J$31,(($AN28-1)*5)+1,$AO28))","v":""},{"$f":"IF(OR($AN28=\"\",$AO28=\"\"),\"\",INDEX('Uncertainy tables (Beta)'!$G$7:$J$31,(($AN28-1)*5)+2,$AO28))","v":""},{"$f":"IF(OR($AN28=\"\",$AO28=\"\"),\"\",INDEX('Uncertainy tables (Beta)'!$G$7:$J$31,(($AN28-1)*5)+3,$AO28))","v":""},{"$f":"IF(OR($AN28=\"\",$AO28=\"\"),\"\",INDEX('Uncertainy tables (Beta)'!$G$7:$J$31,(($AN28-1)*5)+4,$AO28))","v":""},{"$f":"IF(OR($AN28=\"\",$AO28=\"\"),\"\",INDEX('Uncertainy tables (Beta)'!$G$7:$J$31,(($AN28-1)*5)+5,$AO28))","v":""},null,"","",{"$f":"IF(OR($AV28=\"\",$AW28=\"\"),\"\",INDEX('Uncertainy tables (Beta)'!$G$7:$J$31,(($AV28-1)*5)+1,$AW28))","v":""},{"$f":"IF(OR($AV28=\"\",$AW28=\"\"),\"\",INDEX('Uncertainy tables (Beta)'!$G$7:$J$31,(($AV28-1)*5)+2,$AW28))","v":""},{"$f":"IF(OR($AV28=\"\",$AW28=\"\"),\"\",INDEX('Uncertainy tables (Beta)'!$G$7:$J$31,(($AV28-1)*5)+3,$AW28))","v":""},{"$f":"IF(OR($AV28=\"\",$AW28=\"\"),\"\",INDEX('Uncertainy tables (Beta)'!$G$7:$J$31,(($AV28-1)*5)+4,$AW28))","v":""},{"$f":"IF(OR($AV28=\"\",$AW28=\"\"),\"\",INDEX('Uncertainy tables (Beta)'!$G$7:$J$31,(($AV28-1)*5)+5,$AW28))","v":""}]
["xix",{"$f":"IF('Part B - Exporting'!B70=0,\"\",'Part B - Exporting'!B70)","v":""},null,null,null,null,null,null,null,null,null,null,{"$f":"IF('Part B - Exporting'!C70=0,\"\",'Part B - Exporting'!C70)","v":""},null,null,null,null,null,null,null,null,null,null,null,null,null,null,null,null,null,null,null,null,null,null,null,null,null,19,"","",{"$f":"IF(OR($AN29=\"\",$AO29=\"\"),\"\",INDEX('Uncertainy tables (Beta)'!$G$7:$J$31,(($AN29-1)*5)+1,$AO29))","v":""},{"$f":"IF(OR($AN29=\"\",$AO29=\"\"),\"\",INDEX('Uncertainy tables (Beta)'!$G$7:$J$31,(($AN29-1)*5)+2,$AO29))","v":""},{"$f":"IF(OR($AN29=\"\",$AO29=\"\"),\"\",INDEX('Uncertainy tables (Beta)'!$G$7:$J$31,(($AN29-1)*5)+3,$AO29))","v":""},{"$f":"IF(OR($AN29=\"\",$AO29=\"\"),\"\",INDEX('Uncertainy tables (Beta)'!$G$7:$J$31,(($AN29-1)*5)+4,$AO29))","v":""},{"$f":"IF(OR($AN29=\"\",$AO29=\"\"),\"\",INDEX('Uncertainy tables (Beta)'!$G$7:$J$31,(($AN29-1)*5)+5,$AO29))","v":""},null,"","",{"$f":"IF(OR($AV29=\"\",$AW29=\"\"),\"\",INDEX('Uncertainy tables (Beta)'!$G$7:$J$31,(($AV29-1)*5)+1,$AW29))","v":""},{"$f":"IF(OR($AV29=\"\",$AW29=\"\"),\"\",INDEX('Uncertainy tables (Beta)'!$G$7:$J$31,(($AV29-1)*5)+2,$AW29))","v":""},{"$f":"IF(OR($AV29=\"\",$AW29=\"\"),\"\",INDEX('Uncertainy tables (Beta)'!$G$7:$J$31,(($AV29-1)*5)+3,$AW29))","v":""},{"$f":"IF(OR($AV29=\"\",$AW29=\"\"),\"\",INDEX('Uncertainy tables (Beta)'!$G$7:$J$31,(($AV29-1)*5)+4,$AW29))","v":""},{"$f":"IF(OR($AV29=\"\",$AW29=\"\"),\"\",INDEX('Uncertainy tables (Beta)'!$G$7:$J$31,(($AV29-1)*5)+5,$AW29))","v":""}]
["xx",{"$f":"IF('Part B - Exporting'!B71=0,\"\",'Part B - Exporting'!B71)","v":""},null,null,null,null,null,null,null,null,null,null,{"$f":"IF('Part B - Exporting'!C71=0,\"\",'Part B - Exporting'!C71)","v":""},null,null,null,null,null,null,null,null,null,null,null,null,null,null,null,null,null,null,null,null,null,null,null,null,null,20,"","",{"$f":"IF(OR($AN30=\"\",$AO30=\"\"),\"\",INDEX('Uncertainy tables (Beta)'!$G$7:$J$31,(($AN30-1)*5)+1,$AO30))","v":""},{"$f":"IF(OR($AN30=\"\",$AO30=\"\"),\"\",INDEX('Uncertainy tables (Beta)'!$G$7:$J$31,(($AN30-1)*5)+2,$AO30))","v":""},{"$f":"IF(OR($AN30=\"\",$AO30=\"\"),\"\",INDEX('Uncertainy tables (Beta)'!$G$7:$J$31,(($AN30-1)*5)+3,$AO30))","v":""},{"$f":"IF(OR($AN30=\"\",$AO30=\"\"),\"\",INDEX('Uncertainy tables (Beta)'!$G$7:$J$31,(($AN30-1)*5)+4,$AO30))","v":""},{"$f":"IF(OR($AN30=\"\",$AO30=\"\"),\"\",INDEX('Uncertainy tables (Beta)'!$G$7:$J$31,(($AN30-1)*5)+5,$AO30))","v":""},null,"","",{"$f":"IF(OR($AV30=\"\",$AW30=\"\"),\"\",INDEX('Uncertainy tables (Beta)'!$G$7:$J$31,(($AV30-1)*5)+1,$AW30))","v":""},{"$f":"IF(OR($AV30=\"\",$AW30=\"\"),\"\",INDEX('Uncertainy tables (Beta)'!$G$7:$J$31,(($AV30-1)*5)+2,$AW30))","v":""},{"$f":"IF(OR($AV30=\"\",$AW30=\"\"),\"\",INDEX('Uncertainy tables (Beta)'!$G$7:$J$31,(($AV30-1)*5)+3,$AW30))","v":""},{"$f":"IF(OR($AV30=\"\",$AW30=\"\"),\"\",INDEX('Uncertainy tables (Beta)'!$G$7:$J$31,(($AV30-1)*5)+4,$AW30))","v":""},{"$f":"IF(OR($AV30=\"\",$AW30=\"\"),\"\",INDEX('Uncertainy tables (Beta)'!$G$7:$J$31,(($AV30-1)*5)+5,$AW30))","v":""}]
[]
["表C2.措施指标（验证措施对控制点的影响的能力、生产者可接受度、行业可接受度、社会可接受度）"]
[null,{"$f":"B8","v":"可用的系统方法措施（来自B部分）"},"验证措施对控制点的影响的能力",null,null,"生产者可接受度",null,null,"行业可接受度",null,null,"社会可接受度 ",null,null,null,null,null,null,null,null,null,null,null,null,null,null,null,null,null,null,null,null,null,null,null,null,null,null,null,null,null,{"$f":"C33","v":"验证措施对控制点的影响的能力"},null,null,null,null,null,null,null,{"$f":"F33","v":"生产者可接受度"},null,null,null,null,null,{"$f":"I33","v":"行业可接受度"},null,null,null,null,null,null,null,null,null,{"$f":"I33","v":"行业可接受度"}]
[null,null,"使用控制点调整系统的能力是：",null,null,"生产者可接受度是： ",null,null,"行业可接受度是：",null,null,"社会可接受度是：",null,null,null,null,null,null,null,null,null,null,null,null,null,null,null,null,null,null,null,null,null,null,null,null,null,null,null,null,null,{"$f":"AP35","v":"非常低\t"},{"$f":"AQ35","v":"低"},{"$f":"AR35","v":"中"},{"$f":"AS35","v":"高"},{"$f":"AT35","v":"非常高"},null,null,null,{"$f":"AX35","v":"非常低\t"},{"$f":"AY35","v":"低"},{"$f":"AZ35","v":"中"},{"$f":"BA35","v":"高"},{"$f":"BB35","v":"非常高"},null,null,null,{"$f":"BF35","v":"非常低\t"},{"$f":"BG35","v":"低"},{"$f":"BH35","v":"中"},{"$f":"BI35","v":"高"},{"$f":"BJ35","v":"非常高"},null,null,null,{"$f":"BN35","v":"非常低\t"},{"$f":"BO35","v":"低"},{"$f":"BP35","v":"中"},{"$f":"BQ35","v":"高"},{"$f":"BR35","v":"非常高"}]
[null,null,"评分","不确定性","图表","评分","不确定性","图表","评分","不确定性","图表","评分","不确定性","图表",null,null,null,null,null,null,null,null,null,null,null,null,null,null,null,null,null,null,null,null,null,null,null,null,null,"评分","不确定性",{"$f":"$A$98","v":"非常低\t"},{"$f":"$A$99","v":"低"},{"$f":"$A$100","v":"中"},{"$f":"$A$101","v":"高"},{"$f":"$A$102","v":"非常高"},null,"评分","不确定性",{"$f":"$A$98","v":"非常低\t"},{"$f":"$A$99","v":"低"},{"$f":"$A$100","v":"中"},{"$f":"$A$101","v":"高"},{"$f":"$A$102","v":"非常高"},null,"评分","不确定性",{"$f":"$A$98","v":"非常低\t"},{"$f":"$A$99","v":"低"},{"$f":"$A$100","v":"中"},{"$f":"$A$101","v":"高"},{"$f":"$A$102","v":"非常高"},null,"评分","不确定性",{"$f":"$A$98","v":"非常低\t"},{"$f":"$A$99","v":"低"},{"$f":"$A$100","v":"中"},{"$f":"$A$101","v":"高"},{"$f":"$A$102","v":"非常高"}]
["i",{"$f":"B11","v":""},null,null,null,null,null,null,null,null,null,null,null,null,null,null,null,null,null,null,null,null,null,null,null,null,null,null,null,null,null,null,null,null,null,null,null,null,1,{"$f":"IF(C36=$A$98,1,IF(C36=$A$99,2,IF(C36=$A$100,3,IF(C36=$A$101,4,IF(C36=$A$102,5,\"\")))))","v":""},{"$f":"IF(D36=$B$98,1,IF(D36=$B$99,2,IF(D36=$B$100,3,IF(D36=$B$101,4,\"\"))))","v":""},{"$f":"IF(OR($AN36=\"\",$AO36=\"\"),\"\",INDEX('Uncertainy tables (Beta)'!$G$7:$J$31,(($AN36-1)*5)+1,$AO36))","v":""},{"$f":"IF(OR($AN36=\"\",$AO36=\"\"),\"\",INDEX('Uncertainy tables (Beta)'!$G$7:$J$31,(($AN36-1)*5)+2,$AO36))","v":""},{"$f":"IF(OR($AN36=\"\",$AO36=\"\"),\"\",INDEX('Uncertainy tables (Beta)'!$G$7:$J$31,(($AN36-1)*5)+3,$AO36))","v":""},{"$f":"IF(OR($AN36=\"\",$AO36=\"\"),\"\",INDEX('Uncertainy tables (Beta)'!$G$7:$J$31,(($AN36-1)*5)+4,$AO36))","v":""},{"$f":"IF(OR($AN36=\"\",$AO36=\"\"),\"\",INDEX('Uncertainy tables (Beta)'!$G$7:$J$31,(($AN36-1)*5)+5,$AO36))","v":""},null,{"$f":"IF(F36=$A$98,1,IF(F36=$A$99,2,IF(F36=$A$100,3,IF(F36=$A$101,4,IF(F36=$A$102,5,\"\")))))","v":""},{"$f":"IF(G36=$B$98,1,IF(G36=$B$99,2,IF(G36=$B$100,3,IF(G36=$B$101,4,\"\"))))","v":""},{"$f":"IF(OR($AV36=\"\",$AW36=\"\"),\"\",INDEX('Uncertainy tables (Beta)'!$G$7:$J$31,(($AV36-1)*5)+1,$AW36))","v":""},{"$f":"IF(OR($AV36=\"\",$AW36=\"\"),\"\",INDEX('Uncertainy tables (Beta)'!$G$7:$J$31,(($AV36-1)*5)+2,$AW36))","v":""},{"$f":"IF(OR($AV36=\"\",$AW36=\"\"),\"\",INDEX('Uncertainy tables (Beta)'!$G$7:$J$31,(($AV36-1)*5)+3,$AW36))","v":""},{"$f":"IF(OR($AV36=\"\",$AW36=\"\"),\"\",INDEX('Uncertainy tables (Beta)'!$G$7:$J$31,(($AV36-1)*5)+4,$AW36))","v":""},{"$f":"IF(OR($AV36=\"\",$AW36=\"\"),\"\",INDEX('Uncertainy tables (Beta)'!$G$7:$J$31,(($AV36-1)*5)+5,$AW36))","v":""},null,{"$f":"IF(I36=$A$98,1,IF(I36=$A$99,2,IF(I36=$A$100,3,IF(I36=$A$101,4,IF(I36=$A$102,5,\"\")))))","v":""},{"$f":"IF(J36=$B$98,1,IF(J36=$B$99,2,IF(J36=$B$100,3,IF(J36=$B$101,4,\"\"))))","v":""},{"$f":"IF(OR($BD36=\"\",$BE36=\"\"),\"\",INDEX('Uncertainy tables (Beta)'!$G$7:$J$31,(($BD36-1)*5)+1,$BE36))","v":""},{"$f":"IF(OR($BD36=\"\",$BE36=\"\"),\"\",INDEX('Uncertainy tables (Beta)'!$G$7:$J$31,(($BD36-1)*5)+2,$BE36))","v":""},{"$f":"IF(OR($BD36=\"\",$BE36=\"\"),\"\",INDEX('Uncertainy tables (Beta)'!$G$7:$J$31,(($BD36-1)*5)+3,$BE36))","v":""},{"$f":"IF(OR($BD36=\"\",$BE36=\"\"),\"\",INDEX('Uncertainy tables (Beta)'!$G$7:$J$31,(($BD36-1)*5)+4,$BE36))","v":""},{"$f":"IF(OR($BD36=\"\",$BE36=\"\"),\"\",INDEX('Uncertainy tables (Beta)'!$G$7:$J$31,(($BD36-1)*5)+5,$BE36))","v":""},null,{"$f":"IF(L36=$A$98,1,IF(L36=$A$99,2,IF(L36=$A$100,3,IF(L36=$A$101,4,IF(L36=$A$102,5,\"\")))))","v":""},{"$f":"IF(M36=$B$98,1,IF(M36=$B$99,2,IF(M36=$B$100,3,IF(M36=$B$101,4,\"\"))))","v":""},{"$f":"IF(OR($BL36=\"\",$BM36=\"\"),\"\",INDEX('Uncertainy tables (Beta)'!$G$7:$J$31,(($BL36-1)*5)+1,$BM36))","v":""},{"$f":"IF(OR($BL36=\"\",$BM36=\"\"),\"\",INDEX('Uncertainy tables (Beta)'!$G$7:$J$31,(($BL36-1)*5)+2,$BM36))","v":""},{"$f":"IF(OR($BL36=\"\",$BM36=\"\"),\"\",INDEX('Uncertainy tables (Beta)'!$G$7:$J$31,(($BL36-1)*5)+3,$BM36))","v":""},{"$f":"IF(OR($BL36=\"\",$BM36=\"\"),\"\",INDEX('Uncertainy tables (Beta)'!$G$7:$J$31,(($BL36-1)*5)+4,$BM36))","v":""},{"$f":"IF(OR($BL36=\"\",$BM36=\"\"),\"\",INDEX('Uncertainy tables (Beta)'!$G$7:$J$31,(($BL36-1)*5)+5,$BM36))","v":""}]
["ii",{"$f":"B12","v":""},null,null,null,null,null,null,null,null,null,null,null,null,null,null,null,null,null,null,null,null,null,null,null,null,null,null,null,null,null,null,null,null,null,null,null,null,{"$f":"AM36+1","v":2},{"$f":"IF(C37=$A$98,1,IF(C37=$A$99,2,IF(C37=$A$100,3,IF(C37=$A$101,4,IF(C37=$A$102,5,\"\")))))","v":""},"",{"$f":"IF(OR($AN37=\"\",$AO37=\"\"),\"\",INDEX('Uncertainy tables (Beta)'!$G$7:$J$31,(($AN37-1)*5)+1,$AO37))","v":""},{"$f":"IF(OR($AN37=\"\",$AO37=\"\"),\"\",INDEX('Uncertainy tables (Beta)'!$G$7:$J$31,(($AN37-1)*5)+2,$AO37))","v":""},{"$f":"IF(OR($AN37=\"\",$AO37=\"\"),\"\",INDEX('Uncertainy tables (Beta)'!$G$7:$J$31,(($AN37-1)*5)+3,$AO37))","v":""},{"$f":"IF(OR($AN37=\"\",$AO37=\"\"),\"\",INDEX('Uncertainy tables (Beta)'!$G$7:$J$31,(($AN37-1)*5)+4,$AO37))","v":""},{"$f":"IF(OR($AN37=\"\",$AO37=\"\"),\"\",INDEX('Uncertainy tables (Beta)'!$G$7:$J$31,(($AN37-1)*5)+5,$AO37))","v":""},null,{"$f":"IF(F37=$A$98,1,IF(F37=$A$99,2,IF(F37=$A$100,3,IF(F37=$A$101,4,IF(F37=$A$102,5,\"\")))))","v":""},"",{"$f":"IF(OR($AV37=\"\",$AW37=\"\"),\"\",INDEX('Uncertainy tables (Beta)'!$G$7:$J$31,(($AV37-1)*5)+1,$AW37))","v":""},{"$f":"IF(OR($AV37=\"\",$AW37=\"\"),\"\",INDEX('Uncertainy tables (Beta)'!$G$7:$J$31,(($AV37-1)*5)+2,$AW37))","v":""},{"$f":"IF(OR($AV37=\"\",$AW37=\"\"),\"\",INDEX('Uncertainy tables (Beta)'!$G$7:$J$31,(($AV37-1)*5)+3,$AW37))","v":""},{"$f":"IF(OR($AV37=\"\",$AW37=\"\"),\"\",INDEX('Uncertainy tables (Beta)'!$G$7:$J$31,(($AV37-1)*5)+4,$AW37))","v":""},{"$f":"IF(OR($AV37=\"\",$AW37=\"\"),\"\",INDEX('Uncertainy tables (Beta)'!$G$7:$J$31,(($AV37-1)*5)+5,$AW37))","v":""},null,{"$f":"IF(I37=$A$98,1,IF(I37=$A$99,2,IF(I37=$A$100,3,IF(I37=$A$101,4,IF(I37=$A$102,5,\"\")))))","v":""},"",{"$f":"IF(OR($BD37=\"\",$BE37=\"\"),\"\",INDEX('Uncertainy tables (Beta)'!$G$7:$J$31,(($BD37-1)*5)+1,$BE37))","v":""},{"$f":"IF(OR($BD37=\"\",$BE37=\"\"),\"\",INDEX('Uncertainy tables (Beta)'!$G$7:$J$31,(($BD37-1)*5)+2,$BE37))","v":""},{"$f":"IF(OR($BD37=\"\",$BE37=\"\"),\"\",INDEX('Uncertainy tables (Beta)'!$G$7:$J$31,(($BD37-1)*5)+3,$BE37))","v":""},{"$f":"IF(OR($BD37=\"\",$BE37=\"\"),\"\",INDEX('Uncertainy tables (Beta)'!$G$7:$J$31,(($BD37-1)*5)+4,$BE37))","v":""},{"$f":"IF(OR($BD37=\"\",$BE37=\"\"),\"\",INDEX('Uncertainy tables (Beta)'!$G$7:$J$31,(($BD37-1)*5)+5,$BE37))","v":""},null,{"$f":"IF(L37=$A$98,1,IF(L37=$A$99,2,IF(L37=$A$100,3,IF(L37=$A$101,4,IF(L37=$A$102,5,\"\")))))","v":""},"",{"$f":"IF(OR($BL37=\"\",$BM37=\"\"),\"\",INDEX('Uncertainy tables (Beta)'!$G$7:$J$31,(($BL37-1)*5)+1,$BM37))","v":""},{"$f":"IF(OR($BL37=\"\",$BM37=\"\"),\"\",INDEX('Uncertainy tables (Beta)'!$G$7:$J$31,(($BL37-1)*5)+2,$BM37))","v":""},{"$f":"IF(OR($BL37=\"\",$BM37=\"\"),\"\",INDEX('Uncertainy tables (Beta)'!$G$7:$J$31,(($BL37-1)*5)+3,$BM37))","v":""},{"$f":"IF(OR($BL37=\"\",$BM37=\"\"),\"\",INDEX('Uncertainy tables (Beta)'!$G$7:$J$31,(($BL37-1)*5)+4,$BM37))","v":""},{"$f":"IF(OR($BL37=\"\",$BM37=\"\"),\"\",INDEX('Uncertainy tables (Beta)'!$G$7:$J$31,(($BL37-1)*5)+5,$BM37))","v":""}]
["iii","",null,null,null,null,null,null,null,null,null,null,null,null,null,null,null,null,null,null,null,null,null,null,null,null,null,null,null,null,null,null,null,null,null,null,null,null,{"$f":"AM37+1","v":3},"","",{"$f":"IF(OR($AN38=\"\",$AO38=\"\"),\"\",INDEX('Uncertainy tables (Beta)'!$G$7:$J$31,(($AN38-1)*5)+1,$AO38))","v":""},{"$f":"IF(OR($AN38=\"\",$AO38=\"\"),\"\",INDEX('Uncertainy tables (Beta)'!$G$7:$J$31,(($AN38-1)*5)+2,$AO38))","v":""},{"$f":"IF(OR($AN38=\"\",$AO38=\"\"),\"\",INDEX('Uncertainy tables (Beta)'!$G$7:$J$31,(($AN38-1)*5)+3,$AO38))","v":""},{"$f":"IF(OR($AN38=\"\",$AO38=\"\"),\"\",INDEX('Uncertainy tables (Beta)'!$G$7:$J$31,(($AN38-1)*5)+4,$AO38))","v":""},{"$f":"IF(OR($AN38=\"\",$AO38=\"\"),\"\",INDEX('Uncertainy tables (Beta)'!$G$7:$J$31,(($AN38-1)*5)+5,$AO38))","v":""},null,"","",{"$f":"IF(OR($AV38=\"\",$AW38=\"\"),\"\",INDEX('Uncertainy tables (Beta)'!$G$7:$J$31,(($AV38-1)*5)+1,$AW38))","v":""},{"$f":"IF(OR($AV38=\"\",$AW38=\"\"),\"\",INDEX('Uncertainy tables (Beta)'!$G$7:$J$31,(($AV38-1)*5)+2,$AW38))","v":""},{"$f":"IF(OR($AV38=\"\",$AW38=\"\"),\"\",INDEX('Uncertainy tables (Beta)'!$G$7:$J$31,(($AV38-1)*5)+3,$AW38))","v":""},{"$f":"IF(OR($AV38=\"\",$AW38=\"\"),\"\",INDEX('Uncertainy tables (Beta)'!$G$7:$J$31,(($AV38-1)*5)+4,$AW38))","v":""},{"$f":"IF(OR($AV38=\"\",$AW38=\"\"),\"\",INDEX('Uncertainy tables (Beta)'!$G$7:$J$31,(($AV38-1)*5)+5,$AW38))","v":""},null,"","",{"$f":"IF(OR($BD38=\"\",$BE38=\"\"),\"\",INDEX('Uncertainy tables (Beta)'!$G$7:$J$31,(($BD38-1)*5)+1,$BE38))","v":""},{"$f":"IF(OR($BD38=\"\",$BE38=\"\"),\"\",INDEX('Uncertainy tables (Beta)'!$G$7:$J$31,(($BD38-1)*5)+2,$BE38))","v":""},{"$f":"IF(OR($BD38=\"\",$BE38=\"\"),\"\",INDEX('Uncertainy tables (Beta)'!$G$7:$J$31,(($BD38-1)*5)+3,$BE38))","v":""},{"$f":"IF(OR($BD38=\"\",$BE38=\"\"),\"\",INDEX('Uncertainy tables (Beta)'!$G$7:$J$31,(($BD38-1)*5)+4,$BE38))","v":""},{"$f":"IF(OR($BD38=\"\",$BE38=\"\"),\"\",INDEX('Uncertainy tables (Beta)'!$G$7:$J$31,(($BD38-1)*5)+5,$BE38))","v":""},null,"","",{"$f":"IF(OR($BL38=\"\",$BM38=\"\"),\"\",INDEX('Uncertainy tables (Beta)'!$G$7:$J$31,(($BL38-1)*5)+1,$BM38))","v":""},{"$f":"IF(OR($BL38=\"\",$BM38=\"\"),\"\",INDEX('Uncertainy tables (Beta)'!$G$7:$J$31,(($BL38-1)*5)+2,$BM38))","v":""},{"$f":"IF(OR($BL38=\"\",$BM38=\"\"),\"\",INDEX('Uncertainy tables (Beta)'!$G$7:$J$31,(($BL38-1)*5)+3,$BM38))","v":""},{"$f":"IF(OR($BL38=\"\",$BM38=\"\"),\"\",INDEX('Uncertainy tables (Beta)'!$G$7:$J$31,(($BL38-1)*5)+4,$BM38))","v":""},{"$f":"IF(OR($BL38=\"\",$BM38=\"\"),\"\",INDEX('Uncertainy tables (Beta)'!$G$7:$J$31,(($BL38-1)*5)+5,$BM38))","v":""}]
["iv","",null,null,null,null,null,null,null,null,null,null,null,null,null,null,null,null,null,null,null,null,null,null,null,null,null,null,null,null,null,null,null,null,null,null,null,null,4,"","",{"$f":"IF(OR($AN39=\"\",$AO39=\"\"),\"\",INDEX('Uncertainy tables (Beta)'!$G$7:$J$31,(($AN39-1)*5)+1,$AO39))","v":""},{"$f":"IF(OR($AN39=\"\",$AO39=\"\"),\"\",INDEX('Uncertainy tables (Beta)'!$G$7:$J$31,(($AN39-1)*5)+2,$AO39))","v":""},{"$f":"IF(OR($AN39=\"\",$AO39=\"\"),\"\",INDEX('Uncertainy tables (Beta)'!$G$7:$J$31,(($AN39-1)*5)+3,$AO39))","v":""},{"$f":"IF(OR($AN39=\"\",$AO39=\"\"),\"\",INDEX('Uncertainy tables (Beta)'!$G$7:$J$31,(($AN39-1)*5)+4,$AO39))","v":""},{"$f":"IF(OR($AN39=\"\",$AO39=\"\"),\"\",INDEX('Uncertainy tables (Beta)'!$G$7:$J$31,(($AN39-1)*5)+5,$AO39))","v":""},null,"","",{"$f":"IF(OR($AV39=\"\",$AW39=\"\"),\"\",INDEX('Uncertainy tables (Beta)'!$G$7:$J$31,(($AV39-1)*5)+1,$AW39))","v":""},{"$f":"IF(OR($AV39=\"\",$AW39=\"\"),\"\",INDEX('Uncertainy tables (Beta)'!$G$7:$J$31,(($AV39-1)*5)+2,$AW39))","v":""},{"$f":"IF(OR($AV39=\"\",$AW39=\"\"),\"\",INDEX('Uncertainy tables (Beta)'!$G$7:$J$31,(($AV39-1)*5)+3,$AW39))","v":""},{"$f":"IF(OR($AV39=\"\",$AW39=\"\"),\"\",INDEX('Uncertainy tables (Beta)'!$G$7:$J$31,(($AV39-1)*5)+4,$AW39))","v":""},{"$f":"IF(OR($AV39=\"\",$AW39=\"\"),\"\",INDEX('Uncertainy tables (Beta)'!$G$7:$J$31,(($AV39-1)*5)+5,$AW39))","v":""},null,"","",{"$f":"IF(OR($BD39=\"\",$BE39=\"\"),\"\",INDEX('Uncertainy tables (Beta)'!$G$7:$J$31,(($BD39-1)*5)+1,$BE39))","v":""},{"$f":"IF(OR($BD39=\"\",$BE39=\"\"),\"\",INDEX('Uncertainy tables (Beta)'!$G$7:$J$31,(($BD39-1)*5)+2,$BE39))","v":""},{"$f":"IF(OR($BD39=\"\",$BE39=\"\"),\"\",INDEX('Uncertainy tables (Beta)'!$G$7:$J$31,(($BD39-1)*5)+3,$BE39))","v":""},{"$f":"IF(OR($BD39=\"\",$BE39=\"\"),\"\",INDEX('Uncertainy tables (Beta)'!$G$7:$J$31,(($BD39-1)*5)+4,$BE39))","v":""},{"$f":"IF(OR($BD39=\"\",$BE39=\"\"),\"\",INDEX('Uncertainy tables (Beta)'!$G$7:$J$31,(($BD39-1)*5)+5,$BE39))","v":""},null,"","",{"$f":"IF(OR($BL39=\"\",$BM39=\"\"),\"\",INDEX('Uncertainy tables (Beta)'!$G$7:$J$31,(($BL39-1)*5)+1,$BM39))","v":""},{"$f":"IF(OR($BL39=\"\",$BM39=\"\"),\"\",INDEX('Uncertainy tables (Beta)'!$G$7:$J$31,(($BL39-1)*5)+2,$BM39))","v":""},{"$f":"IF(OR($BL39=\"\",$BM39=\"\"),\"\",INDEX('Uncertainy tables (Beta)'!$G$7:$J$31,(($BL39-1)*5)+3,$BM39))","v":""},{"$f":"IF(OR($BL39=\"\",$BM39=\"\"),\"\",INDEX('Uncertainy tables (Beta)'!$G$7:$J$31,(($BL39-1)*5)+4,$BM39))","v":""},{"$f":"IF(OR($BL39=\"\",$BM39=\"\"),\"\",INDEX('Uncertainy tables (Beta)'!$G$7:$J$31,(($BL39-1)*5)+5,$BM39))","v":""}]
["v","",null,null,null,null,null,null,null,null,null,null,null,null,null,null,null,null,null,null,null,null,null,null,null,null,null,null,null,null,null,null,null,null,null,null,null,null,5,"","",{"$f":"IF(OR($AN40=\"\",$AO40=\"\"),\"\",INDEX('Uncertainy tables (Beta)'!$G$7:$J$31,(($AN40-1)*5)+1,$AO40))","v":""},{"$f":"IF(OR($AN40=\"\",$AO40=\"\"),\"\",INDEX('Uncertainy tables (Beta)'!$G$7:$J$31,(($AN40-1)*5)+2,$AO40))","v":""},{"$f":"IF(OR($AN40=\"\",$AO40=\"\"),\"\",INDEX('Uncertainy tables (Beta)'!$G$7:$J$31,(($AN40-1)*5)+3,$AO40))","v":""},{"$f":"IF(OR($AN40=\"\",$AO40=\"\"),\"\",INDEX('Uncertainy tables (Beta)'!$G$7:$J$31,(($AN40-1)*5)+4,$AO40))","v":""},{"$f":"IF(OR($AN40=\"\",$AO40=\"\"),\"\",INDEX('Uncertainy tables (Beta)'!$G$7:$J$31,(($AN40-1)*5)+5,$AO40))","v":""},null,"","",{"$f":"IF(OR($AV40=\"\",$AW40=\"\"),\"\",INDEX('Uncertainy tables (Beta)'!$G$7:$J$31,(($AV40-1)*5)+1,$AW40))","v":""},{"$f":"IF(OR($AV40=\"\",$AW40=\"\"),\"\",INDEX('Uncertainy tables (Beta)'!$G$7:$J$31,(($AV40-1)*5)+2,$AW40))","v":""},{"$f":"IF(OR($AV40=\"\",$AW40=\"\"),\"\",INDEX('Uncertainy tables (Beta)'!$G$7:$J$31,(($AV40-1)*5)+3,$AW40))","v":""},{"$f":"IF(OR($AV40=\"\",$AW40=\"\"),\"\",INDEX('Uncertainy tables (Beta)'!$G$7:$J$31,(($AV40-1)*5)+4,$AW40))","v":""},{"$f":"IF(OR($AV40=\"\",$AW40=\"\"),\"\",INDEX('Uncertainy tables (Beta)'!$G$7:$J$31,(($AV40-1)*5)+5,$AW40))","v":""},null,"","",{"$f":"IF(OR($BD40=\"\",$BE40=\"\"),\"\",INDEX('Uncertainy tables (Beta)'!$G$7:$J$31,(($BD40-1)*5)+1,$BE40))","v":""},{"$f":"IF(OR($BD40=\"\",$BE40=\"\"),\"\",INDEX('Uncertainy tables (Beta)'!$G$7:$J$31,(($BD40-1)*5)+2,$BE40))","v":""},{"$f":"IF(OR($BD40=\"\",$BE40=\"\"),\"\",INDEX('Uncertainy tables (Beta)'!$G$7:$J$31,(($BD40-1)*5)+3,$BE40))","v":""},{"$f":"IF(OR($BD40=\"\",$BE40=\"\"),\"\",INDEX('Uncertainy tables (Beta)'!$G$7:$J$31,(($BD40-1)*5)+4,$BE40))","v":""},{"$f":"IF(OR($BD40=\"\",$BE40=\"\"),\"\",INDEX('Uncertainy tables (Beta)'!$G$7:$J$31,(($BD40-1)*5)+5,$BE40))","v":""},null,"","",{"$f":"IF(OR($BL40=\"\",$BM40=\"\"),\"\",INDEX('Uncertainy tables (Beta)'!$G$7:$J$31,(($BL40-1)*5)+1,$BM40))","v":""},{"$f":"IF(OR($BL40=\"\",$BM40=\"\"),\"\",INDEX('Uncertainy tables (Beta)'!$G$7:$J$31,(($BL40-1)*5)+2,$BM40))","v":""},{"$f":"IF(OR($BL40=\"\",$BM40=\"\"),\"\",INDEX('Uncertainy tables (Beta)'!$G$7:$J$31,(($BL40-1)*5)+3,$BM40))","v":""},{"$f":"IF(OR($BL40=\"\",$BM40=\"\"),\"\",INDEX('Uncertainy tables (Beta)'!$G$7:$J$31,(($BL40-1)*5)+4,$BM40))","v":""},{"$f":"IF(OR($BL40=\"\",$BM40=\"\"),\"\",INDEX('Uncertainy tables (Beta)'!$G$7:$J$31,(($BL40-1)*5)+5,$BM40))","v":""}]
["vi","",null,null,null,null,null,null,null,null,null,null,null,null,null,null,null,null,null,null,null,null,null,null,null,null,null,null,null,null,null,null,null,null,null,null,null,null,6,"","",{"$f":"IF(OR($AN41=\"\",$AO41=\"\"),\"\",INDEX('Uncertainy tables (Beta)'!$G$7:$J$31,(($AN41-1)*5)+1,$AO41))","v":""},{"$f":"IF(OR($AN41=\"\",$AO41=\"\"),\"\",INDEX('Uncertainy tables (Beta)'!$G$7:$J$31,(($AN41-1)*5)+2,$AO41))","v":""},{"$f":"IF(OR($AN41=\"\",$AO41=\"\"),\"\",INDEX('Uncertainy tables (Beta)'!$G$7:$J$31,(($AN41-1)*5)+3,$AO41))","v":""},{"$f":"IF(OR($AN41=\"\",$AO41=\"\"),\"\",INDEX('Uncertainy tables (Beta)'!$G$7:$J$31,(($AN41-1)*5)+4,$AO41))","v":""},{"$f":"IF(OR($AN41=\"\",$AO41=\"\"),\"\",INDEX('Uncertainy tables (Beta)'!$G$7:$J$31,(($AN41-1)*5)+5,$AO41))","v":""},null,"","",{"$f":"IF(OR($AV41=\"\",$AW41=\"\"),\"\",INDEX('Uncertainy tables (Beta)'!$G$7:$J$31,(($AV41-1)*5)+1,$AW41))","v":""},{"$f":"IF(OR($AV41=\"\",$AW41=\"\"),\"\",INDEX('Uncertainy tables (Beta)'!$G$7:$J$31,(($AV41-1)*5)+2,$AW41))","v":""},{"$f":"IF(OR($AV41=\"\",$AW41=\"\"),\"\",INDEX('Uncertainy tables (Beta)'!$G$7:$J$31,(($AV41-1)*5)+3,$AW41))","v":""},{"$f":"IF(OR($AV41=\"\",$AW41=\"\"),\"\",INDEX('Uncertainy tables (Beta)'!$G$7:$J$31,(($AV41-1)*5)+4,$AW41))","v":""},{"$f":"IF(OR($AV41=\"\",$AW41=\"\"),\"\",INDEX('Uncertainy tables (Beta)'!$G$7:$J$31,(($AV41-1)*5)+5,$AW41))","v":""},null,"","",{"$f":"IF(OR($BD41=\"\",$BE41=\"\"),\"\",INDEX('Uncertainy tables (Beta)'!$G$7:$J$31,(($BD41-1)*5)+1,$BE41))","v":""},{"$f":"IF(OR($BD41=\"\",$BE41=\"\"),\"\",INDEX('Uncertainy tables (Beta)'!$G$7:$J$31,(($BD41-1)*5)+2,$BE41))","v":""},{"$f":"IF(OR($BD41=\"\",$BE41=\"\"),\"\",INDEX('Uncertainy tables (Beta)'!$G$7:$J$31,(($BD41-1)*5)+3,$BE41))","v":""},{"$f":"IF(OR($BD41=\"\",$BE41=\"\"),\"\",INDEX('Uncertainy tables (Beta)'!$G$7:$J$31,(($BD41-1)*5)+4,$BE41))","v":""},{"$f":"IF(OR($BD41=\"\",$BE41=\"\"),\"\",INDEX('Uncertainy tables (Beta)'!$G$7:$J$31,(($BD41-1)*5)+5,$BE41))","v":""},null,"","",{"$f":"IF(OR($BL41=\"\",$BM41=\"\"),\"\",INDEX('Uncertainy tables (Beta)'!$G$7:$J$31,(($BL41-1)*5)+1,$BM41))","v":""},{"$f":"IF(OR($BL41=\"\",$BM41=\"\"),\"\",INDEX('Uncertainy tables (Beta)'!$G$7:$J$31,(($BL41-1)*5)+2,$BM41))","v":""},{"$f":"IF(OR($BL41=\"\",$BM41=\"\"),\"\",INDEX('Uncertainy tables (Beta)'!$G$7:$J$31,(($BL41-1)*5)+3,$BM41))","v":""},{"$f":"IF(OR($BL41=\"\",$BM41=\"\"),\"\",INDEX('Uncertainy tables (Beta)'!$G$7:$J$31,(($BL41-1)*5)+4,$BM41))","v":""},{"$f":"IF(OR($BL41=\"\",$BM41=\"\"),\"\",INDEX('Uncertainy tables (Beta)'!$G$7:$J$31,(($BL41-1)*5)+5,$BM41))","v":""}]
["vii","",null,null,null,null,null,null,null,null,null,null,null,null,null,null,null,null,null,null,null,null,null,null,null,null,null,null,null,null,null,null,null,null,null,null,null,null,7,"","",{"$f":"IF(OR($AN42=\"\",$AO42=\"\"),\"\",INDEX('Uncertainy tables (Beta)'!$G$7:$J$31,(($AN42-1)*5)+1,$AO42))","v":""},{"$f":"IF(OR($AN42=\"\",$AO42=\"\"),\"\",INDEX('Uncertainy tables (Beta)'!$G$7:$J$31,(($AN42-1)*5)+2,$AO42))","v":""},{"$f":"IF(OR($AN42=\"\",$AO42=\"\"),\"\",INDEX('Uncertainy tables (Beta)'!$G$7:$J$31,(($AN42-1)*5)+3,$AO42))","v":""},{"$f":"IF(OR($AN42=\"\",$AO42=\"\"),\"\",INDEX('Uncertainy tables (Beta)'!$G$7:$J$31,(($AN42-1)*5)+4,$AO42))","v":""},{"$f":"IF(OR($AN42=\"\",$AO42=\"\"),\"\",INDEX('Uncertainy tables (Beta)'!$G$7:$J$31,(($AN42-1)*5)+5,$AO42))","v":""},null,"","",{"$f":"IF(OR($AV42=\"\",$AW42=\"\"),\"\",INDEX('Uncertainy tables (Beta)'!$G$7:$J$31,(($AV42-1)*5)+1,$AW42))","v":""},{"$f":"IF(OR($AV42=\"\",$AW42=\"\"),\"\",INDEX('Uncertainy tables (Beta)'!$G$7:$J$31,(($AV42-1)*5)+2,$AW42))","v":""},{"$f":"IF(OR($AV42=\"\",$AW42=\"\"),\"\",INDEX('Uncertainy tables (Beta)'!$G$7:$J$31,(($AV42-1)*5)+3,$AW42))","v":""},{"$f":"IF(OR($AV42=\"\",$AW42=\"\"),\"\",INDEX('Uncertainy tables (Beta)'!$G$7:$J$31,(($AV42-1)*5)+4,$AW42))","v":""},{"$f":"IF(OR($AV42=\"\",$AW42=\"\"),\"\",INDEX('Uncertainy tables (Beta)'!$G$7:$J$31,(($AV42-1)*5)+5,$AW42))","v":""},null,"","",{"$f":"IF(OR($BD42=\"\",$BE42=\"\"),\"\",INDEX('Uncertainy tables (Beta)'!$G$7:$J$31,(($BD42-1)*5)+1,$BE42))","v":""},{"$f":"IF(OR($BD42=\"\",$BE42=\"\"),\"\",INDEX('Uncertainy tables (Beta)'!$G$7:$J$31,(($BD42-1)*5)+2,$BE42))","v":""},{"$f":"IF(OR($BD42=\"\",$BE42=\"\"),\"\",INDEX('Uncertainy tables (Beta)'!$G$7:$J$31,(($BD42-1)*5)+3,$BE42))","v":""},{"$f":"IF(OR($BD42=\"\",$BE42=\"\"),\"\",INDEX('Uncertainy tables (Beta)'!$G$7:$J$31,(($BD42-1)*5)+4,$BE42))","v":""},{"$f":"IF(OR($BD42=\"\",$BE42=\"\"),\"\",INDEX('Uncertainy tables (Beta)'!$G$7:$J$31,(($BD42-1)*5)+5,$BE42))","v":""},null,"","",{"$f":"IF(OR($BL42=\"\",$BM42=\"\"),\"\",INDEX('Uncertainy tables (Beta)'!$G$7:$J$31,(($BL42-1)*5)+1,$BM42))","v":""},{"$f":"IF(OR($BL42=\"\",$BM42=\"\"),\"\",INDEX('Uncertainy tables (Beta)'!$G$7:$J$31,(($BL42-1)*5)+2,$BM42))","v":""},{"$f":"IF(OR($BL42=\"\",$BM42=\"\"),\"\",INDEX('Uncertainy tables (Beta)'!$G$7:$J$31,(($BL42-1)*5)+3,$BM42))","v":""},{"$f":"IF(OR($BL42=\"\",$BM42=\"\"),\"\",INDEX('Uncertainy tables (Beta)'!$G$7:$J$31,(($BL42-1)*5)+4,$BM42))","v":""},{"$f":"IF(OR($BL42=\"\",$BM42=\"\"),\"\",INDEX('Uncertainy tables (Beta)'!$G$7:$J$31,(($BL42-1)*5)+5,$BM42))","v":""}]
["viii","",null,null,null,null,null,null,null,null,null,null,null,null,null,null,null,null,null,null,null,null,null,null,null,null,null,null,null,null,null,null,null,null,null,null,null,null,8,"","",{"$f":"IF(OR($AN43=\"\",$AO43=\"\"),\"\",INDEX('Uncertainy tables (Beta)'!$G$7:$J$31,(($AN43-1)*5)+1,$AO43))","v":""},{"$f":"IF(OR($AN43=\"\",$AO43=\"\"),\"\",INDEX('Uncertainy tables (Beta)'!$G$7:$J$31,(($AN43-1)*5)+2,$AO43))","v":""},{"$f":"IF(OR($AN43=\"\",$AO43=\"\"),\"\",INDEX('Uncertainy tables (Beta)'!$G$7:$J$31,(($AN43-1)*5)+3,$AO43))","v":""},{"$f":"IF(OR($AN43=\"\",$AO43=\"\"),\"\",INDEX('Uncertainy tables (Beta)'!$G$7:$J$31,(($AN43-1)*5)+4,$AO43))","v":""},{"$f":"IF(OR($AN43=\"\",$AO43=\"\"),\"\",INDEX('Uncertainy tables (Beta)'!$G$7:$J$31,(($AN43-1)*5)+5,$AO43))","v":""},null,"","",{"$f":"IF(OR($AV43=\"\",$AW43=\"\"),\"\",INDEX('Uncertainy tables (Beta)'!$G$7:$J$31,(($AV43-1)*5)+1,$AW43))","v":""},{"$f":"IF(OR($AV43=\"\",$AW43=\"\"),\"\",INDEX('Uncertainy tables (Beta)'!$G$7:$J$31,(($AV43-1)*5)+2,$AW43))","v":""},{"$f":"IF(OR($AV43=\"\",$AW43=\"\"),\"\",INDEX('Uncertainy tables (Beta)'!$G$7:$J$31,(($AV43-1)*5)+3,$AW43))","v":""},{"$f":"IF(OR($AV43=\"\",$AW43=\"\"),\"\",INDEX('Uncertainy tables (Beta)'!$G$7:$J$31,(($AV43-1)*5)+4,$AW43))","v":""},{"$f":"IF(OR($AV43=\"\",$AW43=\"\"),\"\",INDEX('Uncertainy tables (Beta)'!$G$7:$J$31,(($AV43-1)*5)+5,$AW43))","v":""},null,"","",{"$f":"IF(OR($BD43=\"\",$BE43=\"\"),\"\",INDEX('Uncertainy tables (Beta)'!$G$7:$J$31,(($BD43-1)*5)+1,$BE43))","v":""},{"$f":"IF(OR($BD43=\"\",$BE43=\"\"),\"\",INDEX('Uncertainy tables (Beta)'!$G$7:$J$31,(($BD43-1)*5)+2,$BE43))","v":""},{"$f":"IF(OR($BD43=\"\",$BE43=\"\"),\"\",INDEX('Uncertainy tables (Beta)'!$G$7:$J$31,(($BD43-1)*5)+3,$BE43))","v":""},{"$f":"IF(OR($BD43=\"\",$BE43=\"\"),\"\",INDEX('Uncertainy tables (Beta)'!$G$7:$J$31,(($BD43-1)*5)+4,$BE43))","v":""},{"$f":"IF(OR($BD43=\"\",$BE43=\"\"),\"\",INDEX('Uncertainy tables (Beta)'!$G$7:$J$31,(($BD43-1)*5)+5,$BE43))","v":""},null,"","",{"$f":"IF(OR($BL43=\"\",$BM43=\"\"),\"\",INDEX('Uncertainy tables (Beta)'!$G$7:$J$31,(($BL43-1)*5)+1,$BM43))","v":""},{"$f":"IF(OR($BL43=\"\",$BM43=\"\"),\"\",INDEX('Uncertainy tables (Beta)'!$G$7:$J$31,(($BL43-1)*5)+2,$BM43))","v":""},{"$f":"IF(OR($BL43=\"\",$BM43=\"\"),\"\",INDEX('Uncertainy tables (Beta)'!$G$7:$J$31,(($BL43-1)*5)+3,$BM43))","v":""},{"$f":"IF(OR($BL43=\"\",$BM43=\"\"),\"\",INDEX('Uncertainy tables (Beta)'!$G$7:$J$31,(($BL43-1)*5)+4,$BM43))","v":""},{"$f":"IF(OR($BL43=\"\",$BM43=\"\"),\"\",INDEX('Uncertainy tables (Beta)'!$G$7:$J$31,(($BL43-1)*5)+5,$BM43))","v":""}]
["ix","",null,null,null,null,null,null,null,null,null,null,null,null,null,null,null,null,null,null,null,null,null,null,null,null,null,null,null,null,null,null,null,null,null,null,null,null,9,"","",{"$f":"IF(OR($AN44=\"\",$AO44=\"\"),\"\",INDEX('Uncertainy tables (Beta)'!$G$7:$J$31,(($AN44-1)*5)+1,$AO44))","v":""},{"$f":"IF(OR($AN44=\"\",$AO44=\"\"),\"\",INDEX('Uncertainy tables (Beta)'!$G$7:$J$31,(($AN44-1)*5)+2,$AO44))","v":""},{"$f":"IF(OR($AN44=\"\",$AO44=\"\"),\"\",INDEX('Uncertainy tables (Beta)'!$G$7:$J$31,(($AN44-1)*5)+3,$AO44))","v":""},{"$f":"IF(OR($AN44=\"\",$AO44=\"\"),\"\",INDEX('Uncertainy tables (Beta)'!$G$7:$J$31,(($AN44-1)*5)+4,$AO44))","v":""},{"$f":"IF(OR($AN44=\"\",$AO44=\"\"),\"\",INDEX('Uncertainy tables (Beta)'!$G$7:$J$31,(($AN44-1)*5)+5,$AO44))","v":""},null,"","",{"$f":"IF(OR($AV44=\"\",$AW44=\"\"),\"\",INDEX('Uncertainy tables (Beta)'!$G$7:$J$31,(($AV44-1)*5)+1,$AW44))","v":""},{"$f":"IF(OR($AV44=\"\",$AW44=\"\"),\"\",INDEX('Uncertainy tables (Beta)'!$G$7:$J$31,(($AV44-1)*5)+2,$AW44))","v":""},{"$f":"IF(OR($AV44=\"\",$AW44=\"\"),\"\",INDEX('Uncertainy tables (Beta)'!$G$7:$J$31,(($AV44-1)*5)+3,$AW44))","v":""},{"$f":"IF(OR($AV44=\"\",$AW44=\"\"),\"\",INDEX('Uncertainy tables (Beta)'!$G$7:$J$31,(($AV44-1)*5)+4,$AW44))","v":""},{"$f":"IF(OR($AV44=\"\",$AW44=\"\"),\"\",INDEX('Uncertainy tables (Beta)'!$G$7:$J$31,(($AV44-1)*5)+5,$AW44))","v":""},null,"","",{"$f":"IF(OR($BD44=\"\",$BE44=\"\"),\"\",INDEX('Uncertainy tables (Beta)'!$G$7:$J$31,(($BD44-1)*5)+1,$BE44))","v":""},{"$f":"IF(OR($BD44=\"\",$BE44=\"\"),\"\",INDEX('Uncertainy tables (Beta)'!$G$7:$J$31,(($BD44-1)*5)+2,$BE44))","v":""},{"$f":"IF(OR($BD44=\"\",$BE44=\"\"),\"\",INDEX('Uncertainy tables (Beta)'!$G$7:$J$31,(($BD44-1)*5)+3,$BE44))","v":""},{"$f":"IF(OR($BD44=\"\",$BE44=\"\"),\"\",INDEX('Uncertainy tables (Beta)'!$G$7:$J$31,(($BD44-1)*5)+4,$BE44))","v":""},{"$f":"IF(OR($BD44=\"\",$BE44=\"\"),\"\",INDEX('Uncertainy tables (Beta)'!$G$7:$J$31,(($BD44-1)*5)+5,$BE44))","v":""},null,"","",{"$f":"IF(OR($BL44=\"\",$BM44=\"\"),\"\",INDEX('Uncertainy tables (Beta)'!$G$7:$J$31,(($BL44-1)*5)+1,$BM44))","v":""},{"$f":"IF(OR($BL44=\"\",$BM44=\"\"),\"\",INDEX('Uncertainy tables (Beta)'!$G$7:$J$31,(($BL44-1)*5)+2,$BM44))","v":""},{"$f":"IF(OR($BL44=\"\",$BM44=\"\"),\"\",INDEX('Uncertainy tables (Beta)'!$G$7:$J$31,(($BL44-1)*5)+3,$BM44))","v":""},{"$f":"IF(OR($BL44=\"\",$BM44=\"\"),\"\",INDEX('Uncertainy tables (Beta)'!$G$7:$J$31,(($BL44-1)*5)+4,$BM44))","v":""},{"$f":"IF(OR($BL44=\"\",$BM44=\"\"),\"\",INDEX('Uncertainy tables (Beta)'!$G$7:$J$31,(($BL44-1)*5)+5,$BM44))","v":""}]
["x","",null,null,null,null,null,null,null,null,null,null,null,null,null,null,null,null,null,null,null,null,null,null,null,null,null,null,null,null,null,null,null,null,null,null,null,null,10,"","",{"$f":"IF(OR($AN45=\"\",$AO45=\"\"),\"\",INDEX('Uncertainy tables (Beta)'!$G$7:$J$31,(($AN45-1)*5)+1,$AO45))","v":""},{"$f":"IF(OR($AN45=\"\",$AO45=\"\"),\"\",INDEX('Uncertainy tables (Beta)'!$G$7:$J$31,(($AN45-1)*5)+2,$AO45))","v":""},{"$f":"IF(OR($AN45=\"\",$AO45=\"\"),\"\",INDEX('Uncertainy tables (Beta)'!$G$7:$J$31,(($AN45-1)*5)+3,$AO45))","v":""},{"$f":"IF(OR($AN45=\"\",$AO45=\"\"),\"\",INDEX('Uncertainy tables (Beta)'!$G$7:$J$31,(($AN45-1)*5)+4,$AO45))","v":""},{"$f":"IF(OR($AN45=\"\",$AO45=\"\"),\"\",INDEX('Uncertainy tables (Beta)'!$G$7:$J$31,(($AN45-1)*5)+5,$AO45))","v":""},null,"","",{"$f":"IF(OR($AV45=\"\",$AW45=\"\"),\"\",INDEX('Uncertainy tables (Beta)'!$G$7:$J$31,(($AV45-1)*5)+1,$AW45))","v":""},{"$f":"IF(OR($AV45=\"\",$AW45=\"\"),\"\",INDEX('Uncertainy tables (Beta)'!$G$7:$J$31,(($AV45-1)*5)+2,$AW45))","v":""},{"$f":"IF(OR($AV45=\"\",$AW45=\"\"),\"\",INDEX('Uncertainy tables (Beta)'!$G$7:$J$31,(($AV45-1)*5)+3,$AW45))","v":""},{"$f":"IF(OR($AV45=\"\",$AW45=\"\"),\"\",INDEX('Uncertainy tables (Beta)'!$G$7:$J$31,(($AV45-1)*5)+4,$AW45))","v":""},{"$f":"IF(OR($AV45=\"\",$AW45=\"\"),\"\",INDEX('Uncertainy tables (Beta)'!$G$7:$J$31,(($AV45-1)*5)+5,$AW45))","v":""},null,"","",{"$f":"IF(OR($BD45=\"\",$BE45=\"\"),\"\",INDEX('Uncertainy tables (Beta)'!$G$7:$J$31,(($BD45-1)*5)+1,$BE45))","v":""},{"$f":"IF(OR($BD45=\"\",$BE45=\"\"),\"\",INDEX('Uncertainy tables (Beta)'!$G$7:$J$31,(($BD45-1)*5)+2,$BE45))","v":""},{"$f":"IF(OR($BD45=\"\",$BE45=\"\"),\"\",INDEX('Uncertainy tables (Beta)'!$G$7:$J$31,(($BD45-1)*5)+3,$BE45))","v":""},{"$f":"IF(OR($BD45=\"\",$BE45=\"\"),\"\",INDEX('Uncertainy tables (Beta)'!$G$7:$J$31,(($BD45-1)*5)+4,$BE45))","v":""},{"$f":"IF(OR($BD45=\"\",$BE45=\"\"),\"\",INDEX('Uncertainy tables (Beta)'!$G$7:$J$31,(($BD45-1)*5)+5,$BE45))","v":""},null,"","",{"$f":"IF(OR($BL45=\"\",$BM45=\"\"),\"\",INDEX('Uncertainy tables (Beta)'!$G$7:$J$31,(($BL45-1)*5)+1,$BM45))","v":""},{"$f":"IF(OR($BL45=\"\",$BM45=\"\"),\"\",INDEX('Uncertainy tables (Beta)'!$G$7:$J$31,(($BL45-1)*5)+2,$BM45))","v":""},{"$f":"IF(OR($BL45=\"\",$BM45=\"\"),\"\",INDEX('Uncertainy tables (Beta)'!$G$7:$J$31,(($BL45-1)*5)+3,$BM45))","v":""},{"$f":"IF(OR($BL45=\"\",$BM45=\"\"),\"\",INDEX('Uncertainy tables (Beta)'!$G$7:$J$31,(($BL45-1)*5)+4,$BM45))","v":""},{"$f":"IF(OR($BL45=\"\",$BM45=\"\"),\"\",INDEX('Uncertainy tables (Beta)'!$G$7:$J$31,(($BL45-1)*5)+5,$BM45))","v":""}]
["xi","",null,null,null,null,null,null,null,null,null,null,null,null,null,null,null,null,null,null,null,null,null,null,null,null,null,null,null,null,null,null,null,null,null,null,null,null,11,"","",{"$f":"IF(OR($AN46=\"\",$AO46=\"\"),\"\",INDEX('Uncertainy tables (Beta)'!$G$7:$J$31,(($AN46-1)*5)+1,$AO46))","v":""},{"$f":"IF(OR($AN46=\"\",$AO46=\"\"),\"\",INDEX('Uncertainy tables (Beta)'!$G$7:$J$31,(($AN46-1)*5)+2,$AO46))","v":""},{"$f":"IF(OR($AN46=\"\",$AO46=\"\"),\"\",INDEX('Uncertainy tables (Beta)'!$G$7:$J$31,(($AN46-1)*5)+3,$AO46))","v":""},{"$f":"IF(OR($AN46=\"\",$AO46=\"\"),\"\",INDEX('Uncertainy tables (Beta)'!$G$7:$J$31,(($AN46-1)*5)+4,$AO46))","v":""},{"$f":"IF(OR($AN46=\"\",$AO46=\"\"),\"\",INDEX('Uncertainy tables (Beta)'!$G$7:$J$31,(($AN46-1)*5)+5,$AO46))","v":""},null,"","",{"$f":"IF(OR($AV46=\"\",$AW46=\"\"),\"\",INDEX('Uncertainy tables (Beta)'!$G$7:$J$31,(($AV46-1)*5)+1,$AW46))","v":""},{"$f":"IF(OR($AV46=\"\",$AW46=\"\"),\"\",INDEX('Uncertainy tables (Beta)'!$G$7:$J$31,(($AV46-1)*5)+2,$AW46))","v":""},{"$f":"IF(OR($AV46=\"\",$AW46=\"\"),\"\",INDEX('Uncertainy tables (Beta)'!$G$7:$J$31,(($AV46-1)*5)+3,$AW46))","v":""},{"$f":"IF(OR($AV46=\"\",$AW46=\"\"),\"\",INDEX('Uncertainy tables (Beta)'!$G$7:$J$31,(($AV46-1)*5)+4,$AW46))","v":""},{"$f":"IF(OR($AV46=\"\",$AW46=\"\"),\"\",INDEX('Uncertainy tables (Beta)'!$G$7:$J$31,(($AV46-1)*5)+5,$AW46))","v":""},null,"","",{"$f":"IF(OR($BD46=\"\",$BE46=\"\"),\"\",INDEX('Uncertainy tables (Beta)'!$G$7:$J$31,(($BD46-1)*5)+1,$BE46))","v":""},{"$f":"IF(OR($BD46=\"\",$BE46=\"\"),\"\",INDEX('Uncertainy tables (Beta)'!$G$7:$J$31,(($BD46-1)*5)+2,$BE46))","v":""},{"$f":"IF(OR($BD46=\"\",$BE46=\"\"),\"\",INDEX('Uncertainy tables (Beta)'!$G$7:$J$31,(($BD46-1)*5)+3,$BE46))","v":""},{"$f":"IF(OR($BD46=\"\",$BE46=\"\"),\"\",INDEX('Uncertainy tables (Beta)'!$G$7:$J$31,(($BD46-1)*5)+4,$BE46))","v":""},{"$f":"IF(OR($BD46=\"\",$BE46=\"\"),\"\",INDEX('Uncertainy tables (Beta)'!$G$7:$J$31,(($BD46-1)*5)+5,$BE46))","v":""},null,"","",{"$f":"IF(OR($BL46=\"\",$BM46=\"\"),\"\",INDEX('Uncertainy tables (Beta)'!$G$7:$J$31,(($BL46-1)*5)+1,$BM46))","v":""},{"$f":"IF(OR($BL46=\"\",$BM46=\"\"),\"\",INDEX('Uncertainy tables (Beta)'!$G$7:$J$31,(($BL46-1)*5)+2,$BM46))","v":""},{"$f":"IF(OR($BL46=\"\",$BM46=\"\"),\"\",INDEX('Uncertainy tables (Beta)'!$G$7:$J$31,(($BL46-1)*5)+3,$BM46))","v":""},{"$f":"IF(OR($BL46=\"\",$BM46=\"\"),\"\",INDEX('Uncertainy tables (Beta)'!$G$7:$J$31,(($BL46-1)*5)+4,$BM46))","v":""},{"$f":"IF(OR($BL46=\"\",$BM46=\"\"),\"\",INDEX('Uncertainy tables (Beta)'!$G$7:$J$31,(($BL46-1)*5)+5,$BM46))","v":""}]
["xii","",null,null,null,null,null,null,null,null,null,null,null,null,null,null,null,null,null,null,null,null,null,null,null,null,null,null,null,null,null,null,null,null,null,null,null,null,12,"","",{"$f":"IF(OR($AN47=\"\",$AO47=\"\"),\"\",INDEX('Uncertainy tables (Beta)'!$G$7:$J$31,(($AN47-1)*5)+1,$AO47))","v":""},{"$f":"IF(OR($AN47=\"\",$AO47=\"\"),\"\",INDEX('Uncertainy tables (Beta)'!$G$7:$J$31,(($AN47-1)*5)+2,$AO47))","v":""},{"$f":"IF(OR($AN47=\"\",$AO47=\"\"),\"\",INDEX('Uncertainy tables (Beta)'!$G$7:$J$31,(($AN47-1)*5)+3,$AO47))","v":""},{"$f":"IF(OR($AN47=\"\",$AO47=\"\"),\"\",INDEX('Uncertainy tables (Beta)'!$G$7:$J$31,(($AN47-1)*5)+4,$AO47))","v":""},{"$f":"IF(OR($AN47=\"\",$AO47=\"\"),\"\",INDEX('Uncertainy tables (Beta)'!$G$7:$J$31,(($AN47-1)*5)+5,$AO47))","v":""},null,"","",{"$f":"IF(OR($AV47=\"\",$AW47=\"\"),\"\",INDEX('Uncertainy tables (Beta)'!$G$7:$J$31,(($AV47-1)*5)+1,$AW47))","v":""},{"$f":"IF(OR($AV47=\"\",$AW47=\"\"),\"\",INDEX('Uncertainy tables (Beta)'!$G$7:$J$31,(($AV47-1)*5)+2,$AW47))","v":""},{"$f":"IF(OR($AV47=\"\",$AW47=\"\"),\"\",INDEX('Uncertainy tables (Beta)'!$G$7:$J$31,(($AV47-1)*5)+3,$AW47))","v":""},{"$f":"IF(OR($AV47=\"\",$AW47=\"\"),\"\",INDEX('Uncertainy tables (Beta)'!$G$7:$J$31,(($AV47-1)*5)+4,$AW47))","v":""},{"$f":"IF(OR($AV47=\"\",$AW47=\"\"),\"\",INDEX('Uncertainy tables (Beta)'!$G$7:$J$31,(($AV47-1)*5)+5,$AW47))","v":""},null,"","",{"$f":"IF(OR($BD47=\"\",$BE47=\"\"),\"\",INDEX('Uncertainy tables (Beta)'!$G$7:$J$31,(($BD47-1)*5)+1,$BE47))","v":""},{"$f":"IF(OR($BD47=\"\",$BE47=\"\"),\"\",INDEX('Uncertainy tables (Beta)'!$G$7:$J$31,(($BD47-1)*5)+2,$BE47))","v":""},{"$f":"IF(OR($BD47=\"\",$BE47=\"\"),\"\",INDEX('Uncertainy tables (Beta)'!$G$7:$J$31,(($BD47-1)*5)+3,$BE47))","v":""},{"$f":"IF(OR($BD47=\"\",$BE47=\"\"),\"\",INDEX('Uncertainy tables (Beta)'!$G$7:$J$31,(($BD47-1)*5)+4,$BE47))","v":""},{"$f":"IF(OR($BD47=\"\",$BE47=\"\"),\"\",INDEX('Uncertainy tables (Beta)'!$G$7:$J$31,(($BD47-1)*5)+5,$BE47))","v":""},null,"","",{"$f":"IF(OR($BL47=\"\",$BM47=\"\"),\"\",INDEX('Uncertainy tables (Beta)'!$G$7:$J$31,(($BL47-1)*5)+1,$BM47))","v":""},{"$f":"IF(OR($BL47=\"\",$BM47=\"\"),\"\",INDEX('Uncertainy tables (Beta)'!$G$7:$J$31,(($BL47-1)*5)+2,$BM47))","v":""},{"$f":"IF(OR($BL47=\"\",$BM47=\"\"),\"\",INDEX('Uncertainy tables (Beta)'!$G$7:$J$31,(($BL47-1)*5)+3,$BM47))","v":""},{"$f":"IF(OR($BL47=\"\",$BM47=\"\"),\"\",INDEX('Uncertainy tables (Beta)'!$G$7:$J$31,(($BL47-1)*5)+4,$BM47))","v":""},{"$f":"IF(OR($BL47=\"\",$BM47=\"\"),\"\",INDEX('Uncertainy tables (Beta)'!$G$7:$J$31,(($BL47-1)*5)+5,$BM47))","v":""}]
["xiii","",null,null,null,null,null,null,null,null,null,null,null,null,null,null,null,null,null,null,null,null,null,null,null,null,null,null,null,null,null,null,null,null,null,null,null,null,13,"","",{"$f":"IF(OR($AN48=\"\",$AO48=\"\"),\"\",INDEX('Uncertainy tables (Beta)'!$G$7:$J$31,(($AN48-1)*5)+1,$AO48))","v":""},{"$f":"IF(OR($AN48=\"\",$AO48=\"\"),\"\",INDEX('Uncertainy tables (Beta)'!$G$7:$J$31,(($AN48-1)*5)+2,$AO48))","v":""},{"$f":"IF(OR($AN48=\"\",$AO48=\"\"),\"\",INDEX('Uncertainy tables (Beta)'!$G$7:$J$31,(($AN48-1)*5)+3,$AO48))","v":""},{"$f":"IF(OR($AN48=\"\",$AO48=\"\"),\"\",INDEX('Uncertainy tables (Beta)'!$G$7:$J$31,(($AN48-1)*5)+4,$AO48))","v":""},{"$f":"IF(OR($AN48=\"\",$AO48=\"\"),\"\",INDEX('Uncertainy tables (Beta)'!$G$7:$J$31,(($AN48-1)*5)+5,$AO48))","v":""},null,"","",{"$f":"IF(OR($AV48=\"\",$AW48=\"\"),\"\",INDEX('Uncertainy tables (Beta)'!$G$7:$J$31,(($AV48-1)*5)+1,$AW48))","v":""},{"$f":"IF(OR($AV48=\"\",$AW48=\"\"),\"\",INDEX('Uncertainy tables (Beta)'!$G$7:$J$31,(($AV48-1)*5)+2,$AW48))","v":""},{"$f":"IF(OR($AV48=\"\",$AW48=\"\"),\"\",INDEX('Uncertainy tables (Beta)'!$G$7:$J$31,(($AV48-1)*5)+3,$AW48))","v":""},{"$f":"IF(OR($AV48=\"\",$AW48=\"\"),\"\",INDEX('Uncertainy tables (Beta)'!$G$7:$J$31,(($AV48-1)*5)+4,$AW48))","v":""},{"$f":"IF(OR($AV48=\"\",$AW48=\"\"),\"\",INDEX('Uncertainy tables (Beta)'!$G$7:$J$31,(($AV48-1)*5)+5,$AW48))","v":""},null,"","",{"$f":"IF(OR($BD48=\"\",$BE48=\"\"),\"\",INDEX('Uncertainy tables (Beta)'!$G$7:$J$31,(($BD48-1)*5)+1,$BE48))","v":""},{"$f":"IF(OR($BD48=\"\",$BE48=\"\"),\"\",INDEX('Uncertainy tables (Beta)'!$G$7:$J$31,(($BD48-1)*5)+2,$BE48))","v":""},{"$f":"IF(OR($BD48=\"\",$BE48=\"\"),\"\",INDEX('Uncertainy tables (Beta)'!$G$7:$J$31,(($BD48-1)*5)+3,$BE48))","v":""},{"$f":"IF(OR($BD48=\"\",$BE48=\"\"),\"\",INDEX('Uncertainy tables (Beta)'!$G$7:$J$31,(($BD48-1)*5)+4,$BE48))","v":""},{"$f":"IF(OR($BD48=\"\",$BE48=\"\"),\"\",INDEX('Uncertainy tables (Beta)'!$G$7:$J$31,(($BD48-1)*5)+5,$BE48))","v":""},null,"","",{"$f":"IF(OR($BL48=\"\",$BM48=\"\"),\"\",INDEX('Uncertainy tables (Beta)'!$G$7:$J$31,(($BL48-1)*5)+1,$BM48))","v":""},{"$f":"IF(OR($BL48=\"\",$BM48=\"\"),\"\",INDEX('Uncertainy tables (Beta)'!$G$7:$J$31,(($BL48-1)*5)+2,$BM48))","v":""},{"$f":"IF(OR($BL48=\"\",$BM48=\"\"),\"\",INDEX('Uncertainy tables (Beta)'!$G$7:$J$31,(($BL48-1)*5)+3,$BM48))","v":""},{"$f":"IF(OR($BL48=\"\",$BM48=\"\"),\"\",INDEX('Uncertainy tables (Beta)'!$G$7:$J$31,(($BL48-1)*5)+4,$BM48))","v":""},{"$f":"IF(OR($BL48=\"\",$BM48=\"\"),\"\",INDEX('Uncertainy tables (Beta)'!$G$7:$J$31,(($BL48-1)*5)+5,$BM48))","v":""}]
["xiv","",null,null,null,null,null,null,null,null,null,null,null,null,null,null,null,null,null,null,null,null,null,null,null,null,null,null,null,null,null,null,null,null,null,null,null,null,14,"","",{"$f":"IF(OR($AN49=\"\",$AO49=\"\"),\"\",INDEX('Uncertainy tables (Beta)'!$G$7:$J$31,(($AN49-1)*5)+1,$AO49))","v":""},{"$f":"IF(OR($AN49=\"\",$AO49=\"\"),\"\",INDEX('Uncertainy tables (Beta)'!$G$7:$J$31,(($AN49-1)*5)+2,$AO49))","v":""},{"$f":"IF(OR($AN49=\"\",$AO49=\"\"),\"\",INDEX('Uncertainy tables (Beta)'!$G$7:$J$31,(($AN49-1)*5)+3,$AO49))","v":""},{"$f":"IF(OR($AN49=\"\",$AO49=\"\"),\"\",INDEX('Uncertainy tables (Beta)'!$G$7:$J$31,(($AN49-1)*5)+4,$AO49))","v":""},{"$f":"IF(OR($AN49=\"\",$AO49=\"\"),\"\",INDEX('Uncertainy tables (Beta)'!$G$7:$J$31,(($AN49-1)*5)+5,$AO49))","v":""},null,"","",{"$f":"IF(OR($AV49=\"\",$AW49=\"\"),\"\",INDEX('Uncertainy tables (Beta)'!$G$7:$J$31,(($AV49-1)*5)+1,$AW49))","v":""},{"$f":"IF(OR($AV49=\"\",$AW49=\"\"),\"\",INDEX('Uncertainy tables (Beta)'!$G$7:$J$31,(($AV49-1)*5)+2,$AW49))","v":""},{"$f":"IF(OR($AV49=\"\",$AW49=\"\"),\"\",INDEX('Uncertainy tables (Beta)'!$G$7:$J$31,(($AV49-1)*5)+3,$AW49))","v":""},{"$f":"IF(OR($AV49=\"\",$AW49=\"\"),\"\",INDEX('Uncertainy tables (Beta)'!$G$7:$J$31,(($AV49-1)*5)+4,$AW49))","v":""},{"$f":"IF(OR($AV49=\"\",$AW49=\"\"),\"\",INDEX('Uncertainy tables (Beta)'!$G$7:$J$31,(($AV49-1)*5)+5,$AW49))","v":""},null,"","",{"$f":"IF(OR($BD49=\"\",$BE49=\"\"),\"\",INDEX('Uncertainy tables (Beta)'!$G$7:$J$31,(($BD49-1)*5)+1,$BE49))","v":""},{"$f":"IF(OR($BD49=\"\",$BE49=\"\"),\"\",INDEX('Uncertainy tables (Beta)'!$G$7:$J$31,(($BD49-1)*5)+2,$BE49))","v":""},{"$f":"IF(OR($BD49=\"\",$BE49=\"\"),\"\",INDEX('Uncertainy tables (Beta)'!$G$7:$J$31,(($BD49-1)*5)+3,$BE49))","v":""},{"$f":"IF(OR($BD49=\"\",$BE49=\"\"),\"\",INDEX('Uncertainy tables (Beta)'!$G$7:$J$31,(($BD49-1)*5)+4,$BE49))","v":""},{"$f":"IF(OR($BD49=\"\",$BE49=\"\"),\"\",INDEX('Uncertainy tables (Beta)'!$G$7:$J$31,(($BD49-1)*5)+5,$BE49))","v":""},null,"","",{"$f":"IF(OR($BL49=\"\",$BM49=\"\"),\"\",INDEX('Uncertainy tables (Beta)'!$G$7:$J$31,(($BL49-1)*5)+1,$BM49))","v":""},{"$f":"IF(OR($BL49=\"\",$BM49=\"\"),\"\",INDEX('Uncertainy tables (Beta)'!$G$7:$J$31,(($BL49-1)*5)+2,$BM49))","v":""},{"$f":"IF(OR($BL49=\"\",$BM49=\"\"),\"\",INDEX('Uncertainy tables (Beta)'!$G$7:$J$31,(($BL49-1)*5)+3,$BM49))","v":""},{"$f":"IF(OR($BL49=\"\",$BM49=\"\"),\"\",INDEX('Uncertainy tables (Beta)'!$G$7:$J$31,(($BL49-1)*5)+4,$BM49))","v":""},{"$f":"IF(OR($BL49=\"\",$BM49=\"\"),\"\",INDEX('Uncertainy tables (Beta)'!$G$7:$J$31,(($BL49-1)*5)+5,$BM49))","v":""}]
["xv","",null,null,null,null,null,null,null,null,null,null,null,null,null,null,null,null,null,null,null,null,null,null,null,null,null,null,null,null,null,null,null,null,null,null,null,null,15,"","",{"$f":"IF(OR($AN50=\"\",$AO50=\"\"),\"\",INDEX('Uncertainy tables (Beta)'!$G$7:$J$31,(($AN50-1)*5)+1,$AO50))","v":""},{"$f":"IF(OR($AN50=\"\",$AO50=\"\"),\"\",INDEX('Uncertainy tables (Beta)'!$G$7:$J$31,(($AN50-1)*5)+2,$AO50))","v":""},{"$f":"IF(OR($AN50=\"\",$AO50=\"\"),\"\",INDEX('Uncertainy tables (Beta)'!$G$7:$J$31,(($AN50-1)*5)+3,$AO50))","v":""},{"$f":"IF(OR($AN50=\"\",$AO50=\"\"),\"\",INDEX('Uncertainy tables (Beta)'!$G$7:$J$31,(($AN50-1)*5)+4,$AO50))","v":""},{"$f":"IF(OR($AN50=\"\",$AO50=\"\"),\"\",INDEX('Uncertainy tables (Beta)'!$G$7:$J$31,(($AN50-1)*5)+5,$AO50))","v":""},null,"","",{"$f":"IF(OR($AV50=\"\",$AW50=\"\"),\"\",INDEX('Uncertainy tables (Beta)'!$G$7:$J$31,(($AV50-1)*5)+1,$AW50))","v":""},{"$f":"IF(OR($AV50=\"\",$AW50=\"\"),\"\",INDEX('Uncertainy tables (Beta)'!$G$7:$J$31,(($AV50-1)*5)+2,$AW50))","v":""},{"$f":"IF(OR($AV50=\"\",$AW50=\"\"),\"\",INDEX('Uncertainy tables (Beta)'!$G$7:$J$31,(($AV50-1)*5)+3,$AW50))","v":""},{"$f":"IF(OR($AV50=\"\",$AW50=\"\"),\"\",INDEX('Uncertainy tables (Beta)'!$G$7:$J$31,(($AV50-1)*5)+4,$AW50))","v":""},{"$f":"IF(OR($AV50=\"\",$AW50=\"\"),\"\",INDEX('Uncertainy tables (Beta)'!$G$7:$J$31,(($AV50-1)*5)+5,$AW50))","v":""},null,"","",{"$f":"IF(OR($BD50=\"\",$BE50=\"\"),\"\",INDEX('Uncertainy tables (Beta)'!$G$7:$J$31,(($BD50-1)*5)+1,$BE50))","v":""},{"$f":"IF(OR($BD50=\"\",$BE50=\"\"),\"\",INDEX('Uncertainy tables (Beta)'!$G$7:$J$31,(($BD50-1)*5)+2,$BE50))","v":""},{"$f":"IF(OR($BD50=\"\",$BE50=\"\"),\"\",INDEX('Uncertainy tables (Beta)'!$G$7:$J$31,(($BD50-1)*5)+3,$BE50))","v":""},{"$f":"IF(OR($BD50=\"\",$BE50=\"\"),\"\",INDEX('Uncertainy tables (Beta)'!$G$7:$J$31,(($BD50-1)*5)+4,$BE50))","v":""},{"$f":"IF(OR($BD50=\"\",$BE50=\"\"),\"\",INDEX('Uncertainy tables (Beta)'!$G$7:$J$31,(($BD50-1)*5)+5,$BE50))","v":""},null,"","",{"$f":"IF(OR($BL50=\"\",$BM50=\"\"),\"\",INDEX('Uncertainy tables (Beta)'!$G$7:$J$31,(($BL50-1)*5)+1,$BM50))","v":""},{"$f":"IF(OR($BL50=\"\",$BM50=\"\"),\"\",INDEX('Uncertainy tables (Beta)'!$G$7:$J$31,(($BL50-1)*5)+2,$BM50))","v":""},{"$f":"IF(OR($BL50=\"\",$BM50=\"\"),\"\",INDEX('Uncertainy tables (Beta)'!$G$7:$J$31,(($BL50-1)*5)+3,$BM50))","v":""},{"$f":"IF(OR($BL50=\"\",$BM50=\"\"),\"\",INDEX('Uncertainy tables (Beta)'!$G$7:$J$31,(($BL50-1)*5)+4,$BM50))","v":""},{"$f":"IF(OR($BL50=\"\",$BM50=\"\"),\"\",INDEX('Uncertainy tables (Beta)'!$G$7:$J$31,(($BL50-1)*5)+5,$BM50))","v":""}]
["xvi","",null,null,null,null,null,null,null,null,null,null,null,null,null,null,null,null,null,null,null,null,null,null,null,null,null,null,null,null,null,null,null,null,null,null,null,null,16,"","",{"$f":"IF(OR($AN51=\"\",$AO51=\"\"),\"\",INDEX('Uncertainy tables (Beta)'!$G$7:$J$31,(($AN51-1)*5)+1,$AO51))","v":""},{"$f":"IF(OR($AN51=\"\",$AO51=\"\"),\"\",INDEX('Uncertainy tables (Beta)'!$G$7:$J$31,(($AN51-1)*5)+2,$AO51))","v":""},{"$f":"IF(OR($AN51=\"\",$AO51=\"\"),\"\",INDEX('Uncertainy tables (Beta)'!$G$7:$J$31,(($AN51-1)*5)+3,$AO51))","v":""},{"$f":"IF(OR($AN51=\"\",$AO51=\"\"),\"\",INDEX('Uncertainy tables (Beta)'!$G$7:$J$31,(($AN51-1)*5)+4,$AO51))","v":""},{"$f":"IF(OR($AN51=\"\",$AO51=\"\"),\"\",INDEX('Uncertainy tables (Beta)'!$G$7:$J$31,(($AN51-1)*5)+5,$AO51))","v":""},null,"","",{"$f":"IF(OR($AV51=\"\",$AW51=\"\"),\"\",INDEX('Uncertainy tables (Beta)'!$G$7:$J$31,(($AV51-1)*5)+1,$AW51))","v":""},{"$f":"IF(OR($AV51=\"\",$AW51=\"\"),\"\",INDEX('Uncertainy tables (Beta)'!$G$7:$J$31,(($AV51-1)*5)+2,$AW51))","v":""},{"$f":"IF(OR($AV51=\"\",$AW51=\"\"),\"\",INDEX('Uncertainy tables (Beta)'!$G$7:$J$31,(($AV51-1)*5)+3,$AW51))","v":""},{"$f":"IF(OR($AV51=\"\",$AW51=\"\"),\"\",INDEX('Uncertainy tables (Beta)'!$G$7:$J$31,(($AV51-1)*5)+4,$AW51))","v":""},{"$f":"IF(OR($AV51=\"\",$AW51=\"\"),\"\",INDEX('Uncertainy tables (Beta)'!$G$7:$J$31,(($AV51-1)*5)+5,$AW51))","v":""},null,"","",{"$f":"IF(OR($BD51=\"\",$BE51=\"\"),\"\",INDEX('Uncertainy tables (Beta)'!$G$7:$J$31,(($BD51-1)*5)+1,$BE51))","v":""},{"$f":"IF(OR($BD51=\"\",$BE51=\"\"),\"\",INDEX('Uncertainy tables (Beta)'!$G$7:$J$31,(($BD51-1)*5)+2,$BE51))","v":""},{"$f":"IF(OR($BD51=\"\",$BE51=\"\"),\"\",INDEX('Uncertainy tables (Beta)'!$G$7:$J$31,(($BD51-1)*5)+3,$BE51))","v":""},{"$f":"IF(OR($BD51=\"\",$BE51=\"\"),\"\",INDEX('Uncertainy tables (Beta)'!$G$7:$J$31,(($BD51-1)*5)+4,$BE51))","v":""},{"$f":"IF(OR($BD51=\"\",$BE51=\"\"),\"\",INDEX('Uncertainy tables (Beta)'!$G$7:$J$31,(($BD51-1)*5)+5,$BE51))","v":""},null,"","",{"$f":"IF(OR($BL51=\"\",$BM51=\"\"),\"\",INDEX('Uncertainy tables (Beta)'!$G$7:$J$31,(($BL51-1)*5)+1,$BM51))","v":""},{"$f":"IF(OR($BL51=\"\",$BM51=\"\"),\"\",INDEX('Uncertainy tables (Beta)'!$G$7:$J$31,(($BL51-1)*5)+2,$BM51))","v":""},{"$f":"IF(OR($BL51=\"\",$BM51=\"\"),\"\",INDEX('Uncertainy tables (Beta)'!$G$7:$J$31,(($BL51-1)*5)+3,$BM51))","v":""},{"$f":"IF(OR($BL51=\"\",$BM51=\"\"),\"\",INDEX('Uncertainy tables (Beta)'!$G$7:$J$31,(($BL51-1)*5)+4,$BM51))","v":""},{"$f":"IF(OR($BL51=\"\",$BM51=\"\"),\"\",INDEX('Uncertainy tables (Beta)'!$G$7:$J$31,(($BL51-1)*5)+5,$BM51))","v":""}]
["xvii","",null,null,null,null,null,null,null,null,null,null,null,null,null,null,null,null,null,null,null,null,null,null,null,null,null,null,null,null,null,null,null,null,null,null,null,null,17,"","",{"$f":"IF(OR($AN52=\"\",$AO52=\"\"),\"\",INDEX('Uncertainy tables (Beta)'!$G$7:$J$31,(($AN52-1)*5)+1,$AO52))","v":""},{"$f":"IF(OR($AN52=\"\",$AO52=\"\"),\"\",INDEX('Uncertainy tables (Beta)'!$G$7:$J$31,(($AN52-1)*5)+2,$AO52))","v":""},{"$f":"IF(OR($AN52=\"\",$AO52=\"\"),\"\",INDEX('Uncertainy tables (Beta)'!$G$7:$J$31,(($AN52-1)*5)+3,$AO52))","v":""},{"$f":"IF(OR($AN52=\"\",$AO52=\"\"),\"\",INDEX('Uncertainy tables (Beta)'!$G$7:$J$31,(($AN52-1)*5)+4,$AO52))","v":""},{"$f":"IF(OR($AN52=\"\",$AO52=\"\"),\"\",INDEX('Uncertainy tables (Beta)'!$G$7:$J$31,(($AN52-1)*5)+5,$AO52))","v":""},null,"","",{"$f":"IF(OR($AV52=\"\",$AW52=\"\"),\"\",INDEX('Uncertainy tables (Beta)'!$G$7:$J$31,(($AV52-1)*5)+1,$AW52))","v":""},{"$f":"IF(OR($AV52=\"\",$AW52=\"\"),\"\",INDEX('Uncertainy tables (Beta)'!$G$7:$J$31,(($AV52-1)*5)+2,$AW52))","v":""},{"$f":"IF(OR($AV52=\"\",$AW52=\"\"),\"\",INDEX('Uncertainy tables (Beta)'!$G$7:$J$31,(($AV52-1)*5)+3,$AW52))","v":""},{"$f":"IF(OR($AV52=\"\",$AW52=\"\"),\"\",INDEX('Uncertainy tables (Beta)'!$G$7:$J$31,(($AV52-1)*5)+4,$AW52))","v":""},{"$f":"IF(OR($AV52=\"\",$AW52=\"\"),\"\",INDEX('Uncertainy tables (Beta)'!$G$7:$J$31,(($AV52-1)*5)+5,$AW52))","v":""},null,"","",{"$f":"IF(OR($BD52=\"\",$BE52=\"\"),\"\",INDEX('Uncertainy tables (Beta)'!$G$7:$J$31,(($BD52-1)*5)+1,$BE52))","v":""},{"$f":"IF(OR($BD52=\"\",$BE52=\"\"),\"\",INDEX('Uncertainy tables (Beta)'!$G$7:$J$31,(($BD52-1)*5)+2,$BE52))","v":""},{"$f":"IF(OR($BD52=\"\",$BE52=\"\"),\"\",INDEX('Uncertainy tables (Beta)'!$G$7:$J$31,(($BD52-1)*5)+3,$BE52))","v":""},{"$f":"IF(OR($BD52=\"\",$BE52=\"\"),\"\",INDEX('Uncertainy tables (Beta)'!$G$7:$J$31,(($BD52-1)*5)+4,$BE52))","v":""},{"$f":"IF(OR($BD52=\"\",$BE52=\"\"),\"\",INDEX('Uncertainy tables (Beta)'!$G$7:$J$31,(($BD52-1)*5)+5,$BE52))","v":""},null,"","",{"$f":"IF(OR($BL52=\"\",$BM52=\"\"),\"\",INDEX('Uncertainy tables (Beta)'!$G$7:$J$31,(($BL52-1)*5)+1,$BM52))","v":""},{"$f":"IF(OR($BL52=\"\",$BM52=\"\"),\"\",INDEX('Uncertainy tables (Beta)'!$G$7:$J$31,(($BL52-1)*5)+2,$BM52))","v":""},{"$f":"IF(OR($BL52=\"\",$BM52=\"\"),\"\",INDEX('Uncertainy tables (Beta)'!$G$7:$J$31,(($BL52-1)*5)+3,$BM52))","v":""},{"$f":"IF(OR($BL52=\"\",$BM52=\"\"),\"\",INDEX('Uncertainy tables (Beta)'!$G$7:$J$31,(($BL52-1)*5)+4,$BM52))","v":""},{"$f":"IF(OR($BL52=\"\",$BM52=\"\"),\"\",INDEX('Uncertainy tables (Beta)'!$G$7:$J$31,(($BL52-1)*5)+5,$BM52))","v":""}]
["xviii","",null,null,null,null,null,null,null,null,null,null,null,null,null,null,null,null,null,null,null,null,null,null,null,null,null,null,null,null,null,null,null,null,null,null,null,null,18,"","",{"$f":"IF(OR($AN53=\"\",$AO53=\"\"),\"\",INDEX('Uncertainy tables (Beta)'!$G$7:$J$31,(($AN53-1)*5)+1,$AO53))","v":""},{"$f":"IF(OR($AN53=\"\",$AO53=\"\"),\"\",INDEX('Uncertainy tables (Beta)'!$G$7:$J$31,(($AN53-1)*5)+2,$AO53))","v":""},{"$f":"IF(OR($AN53=\"\",$AO53=\"\"),\"\",INDEX('Uncertainy tables (Beta)'!$G$7:$J$31,(($AN53-1)*5)+3,$AO53))","v":""},{"$f":"IF(OR($AN53=\"\",$AO53=\"\"),\"\",INDEX('Uncertainy tables (Beta)'!$G$7:$J$31,(($AN53-1)*5)+4,$AO53))","v":""},{"$f":"IF(OR($AN53=\"\",$AO53=\"\"),\"\",INDEX('Uncertainy tables (Beta)'!$G$7:$J$31,(($AN53-1)*5)+5,$AO53))","v":""},null,"","",{"$f":"IF(OR($AV53=\"\",$AW53=\"\"),\"\",INDEX('Uncertainy tables (Beta)'!$G$7:$J$31,(($AV53-1)*5)+1,$AW53))","v":""},{"$f":"IF(OR($AV53=\"\",$AW53=\"\"),\"\",INDEX('Uncertainy tables (Beta)'!$G$7:$J$31,(($AV53-1)*5)+2,$AW53))","v":""},{"$f":"IF(OR($AV53=\"\",$AW53=\"\"),\"\",INDEX('Uncertainy tables (Beta)'!$G$7:$J$31,(($AV53-1)*5)+3,$AW53))","v":""},{"$f":"IF(OR($AV53=\"\",$AW53=\"\"),\"\",INDEX('Uncertainy tables (Beta)'!$G$7:$J$31,(($AV53-1)*5)+4,$AW53))","v":""},{"$f":"IF(OR($AV53=\"\",$AW53=\"\"),\"\",INDEX('Uncertainy tables (Beta)'!$G$7:$J$31,(($AV53-1)*5)+5,$AW53))","v":""},null,"","",{"$f":"IF(OR($BD53=\"\",$BE53=\"\"),\"\",INDEX('Uncertainy tables (Beta)'!$G$7:$J$31,(($BD53-1)*5)+1,$BE53))","v":""},{"$f":"IF(OR($BD53=\"\",$BE53=\"\"),\"\",INDEX('Uncertainy tables (Beta)'!$G$7:$J$31,(($BD53-1)*5)+2,$BE53))","v":""},{"$f":"IF(OR($BD53=\"\",$BE53=\"\"),\"\",INDEX('Uncertainy tables (Beta)'!$G$7:$J$31,(($BD53-1)*5)+3,$BE53))","v":""},{"$f":"IF(OR($BD53=\"\",$BE53=\"\"),\"\",INDEX('Uncertainy tables (Beta)'!$G$7:$J$31,(($BD53-1)*5)+4,$BE53))","v":""},{"$f":"IF(OR($BD53=\"\",$BE53=\"\"),\"\",INDEX('Uncertainy tables (Beta)'!$G$7:$J$31,(($BD53-1)*5)+5,$BE53))","v":""},null,"","",{"$f":"IF(OR($BL53=\"\",$BM53=\"\"),\"\",INDEX('Uncertainy tables (Beta)'!$G$7:$J$31,(($BL53-1)*5)+1,$BM53))","v":""},{"$f":"IF(OR($BL53=\"\",$BM53=\"\"),\"\",INDEX('Uncertainy tables (Beta)'!$G$7:$J$31,(($BL53-1)*5)+2,$BM53))","v":""},{"$f":"IF(OR($BL53=\"\",$BM53=\"\"),\"\",INDEX('Uncertainy tables (Beta)'!$G$7:$J$31,(($BL53-1)*5)+3,$BM53))","v":""},{"$f":"IF(OR($BL53=\"\",$BM53=\"\"),\"\",INDEX('Uncertainy tables (Beta)'!$G$7:$J$31,(($BL53-1)*5)+4,$BM53))","v":""},{"$f":"IF(OR($BL53=\"\",$BM53=\"\"),\"\",INDEX('Uncertainy tables (Beta)'!$G$7:$J$31,(($BL53-1)*5)+5,$BM53))","v":""}]
["xix","",null,null,null,null,null,null,null,null,null,null,null,null,null,null,null,null,null,null,null,null,null,null,null,null,null,null,null,null,null,null,null,null,null,null,null,null,19,"","",{"$f":"IF(OR($AN54=\"\",$AO54=\"\"),\"\",INDEX('Uncertainy tables (Beta)'!$G$7:$J$31,(($AN54-1)*5)+1,$AO54))","v":""},{"$f":"IF(OR($AN54=\"\",$AO54=\"\"),\"\",INDEX('Uncertainy tables (Beta)'!$G$7:$J$31,(($AN54-1)*5)+2,$AO54))","v":""},{"$f":"IF(OR($AN54=\"\",$AO54=\"\"),\"\",INDEX('Uncertainy tables (Beta)'!$G$7:$J$31,(($AN54-1)*5)+3,$AO54))","v":""},{"$f":"IF(OR($AN54=\"\",$AO54=\"\"),\"\",INDEX('Uncertainy tables (Beta)'!$G$7:$J$31,(($AN54-1)*5)+4,$AO54))","v":""},{"$f":"IF(OR($AN54=\"\",$AO54=\"\"),\"\",INDEX('Uncertainy tables (Beta)'!$G$7:$J$31,(($AN54-1)*5)+5,$AO54))","v":""},null,"","",{"$f":"IF(OR($AV54=\"\",$AW54=\"\"),\"\",INDEX('Uncertainy tables (Beta)'!$G$7:$J$31,(($AV54-1)*5)+1,$AW54))","v":""},{"$f":"IF(OR($AV54=\"\",$AW54=\"\"),\"\",INDEX('Uncertainy tables (Beta)'!$G$7:$J$31,(($AV54-1)*5)+2,$AW54))","v":""},{"$f":"IF(OR($AV54=\"\",$AW54=\"\"),\"\",INDEX('Uncertainy tables (Beta)'!$G$7:$J$31,(($AV54-1)*5)+3,$AW54))","v":""},{"$f":"IF(OR($AV54=\"\",$AW54=\"\"),\"\",INDEX('Uncertainy tables (Beta)'!$G$7:$J$31,(($AV54-1)*5)+4,$AW54))","v":""},{"$f":"IF(OR($AV54=\"\",$AW54=\"\"),\"\",INDEX('Uncertainy tables (Beta)'!$G$7:$J$31,(($AV54-1)*5)+5,$AW54))","v":""},null,"","",{"$f":"IF(OR($BD54=\"\",$BE54=\"\"),\"\",INDEX('Uncertainy tables (Beta)'!$G$7:$J$31,(($BD54-1)*5)+1,$BE54))","v":""},{"$f":"IF(OR($BD54=\"\",$BE54=\"\"),\"\",INDEX('Uncertainy tables (Beta)'!$G$7:$J$31,(($BD54-1)*5)+2,$BE54))","v":""},{"$f":"IF(OR($BD54=\"\",$BE54=\"\"),\"\",INDEX('Uncertainy tables (Beta)'!$G$7:$J$31,(($BD54-1)*5)+3,$BE54))","v":""},{"$f":"IF(OR($BD54=\"\",$BE54=\"\"),\"\",INDEX('Uncertainy tables (Beta)'!$G$7:$J$31,(($BD54-1)*5)+4,$BE54))","v":""},{"$f":"IF(OR($BD54=\"\",$BE54=\"\"),\"\",INDEX('Uncertainy tables (Beta)'!$G$7:$J$31,(($BD54-1)*5)+5,$BE54))","v":""},null,"","",{"$f":"IF(OR($BL54=\"\",$BM54=\"\"),\"\",INDEX('Uncertainy tables (Beta)'!$G$7:$J$31,(($BL54-1)*5)+1,$BM54))","v":""},{"$f":"IF(OR($BL54=\"\",$BM54=\"\"),\"\",INDEX('Uncertainy tables (Beta)'!$G$7:$J$31,(($BL54-1)*5)+2,$BM54))","v":""},{"$f":"IF(OR($BL54=\"\",$BM54=\"\"),\"\",INDEX('Uncertainy tables (Beta)'!$G$7:$J$31,(($BL54-1)*5)+3,$BM54))","v":""},{"$f":"IF(OR($BL54=\"\",$BM54=\"\"),\"\",INDEX('Uncertainy tables (Beta)'!$G$7:$J$31,(($BL54-1)*5)+4,$BM54))","v":""},{"$f":"IF(OR($BL54=\"\",$BM54=\"\"),\"\",INDEX('Uncertainy tables (Beta)'!$G$7:$J$31,(($BL54-1)*5)+5,$BM54))","v":""}]
["xx","",null,null,null,null,null,null,null,null,null,null,null,null,null,null,null,null,null,null,null,null,null,null,null,null,null,null,null,null,null,null,null,null,null,null,null,null,20,"","",{"$f":"IF(OR($AN55=\"\",$AO55=\"\"),\"\",INDEX('Uncertainy tables (Beta)'!$G$7:$J$31,(($AN55-1)*5)+1,$AO55))","v":""},{"$f":"IF(OR($AN55=\"\",$AO55=\"\"),\"\",INDEX('Uncertainy tables (Beta)'!$G$7:$J$31,(($AN55-1)*5)+2,$AO55))","v":""},{"$f":"IF(OR($AN55=\"\",$AO55=\"\"),\"\",INDEX('Uncertainy tables (Beta)'!$G$7:$J$31,(($AN55-1)*5)+3,$AO55))","v":""},{"$f":"IF(OR($AN55=\"\",$AO55=\"\"),\"\",INDEX('Uncertainy tables (Beta)'!$G$7:$J$31,(($AN55-1)*5)+4,$AO55))","v":""},{"$f":"IF(OR($AN55=\"\",$AO55=\"\"),\"\",INDEX('Uncertainy tables (Beta)'!$G$7:$J$31,(($AN55-1)*5)+5,$AO55))","v":""},null,"","",{"$f":"IF(OR($AV55=\"\",$AW55=\"\"),\"\",INDEX('Uncertainy tables (Beta)'!$G$7:$J$31,(($AV55-1)*5)+1,$AW55))","v":""},{"$f":"IF(OR($AV55=\"\",$AW55=\"\"),\"\",INDEX('Uncertainy tables (Beta)'!$G$7:$J$31,(($AV55-1)*5)+2,$AW55))","v":""},{"$f":"IF(OR($AV55=\"\",$AW55=\"\"),\"\",INDEX('Uncertainy tables (Beta)'!$G$7:$J$31,(($AV55-1)*5)+3,$AW55))","v":""},{"$f":"IF(OR($AV55=\"\",$AW55=\"\"),\"\",INDEX('Uncertainy tables (Beta)'!$G$7:$J$31,(($AV55-1)*5)+4,$AW55))","v":""},{"$f":"IF(OR($AV55=\"\",$AW55=\"\"),\"\",INDEX('Uncertainy tables (Beta)'!$G$7:$J$31,(($AV55-1)*5)+5,$AW55))","v":""},null,"","",{"$f":"IF(OR($BD55=\"\",$BE55=\"\"),\"\",INDEX('Uncertainy tables (Beta)'!$G$7:$J$31,(($BD55-1)*5)+1,$BE55))","v":""},{"$f":"IF(OR($BD55=\"\",$BE55=\"\"),\"\",INDEX('Uncertainy tables (Beta)'!$G$7:$J$31,(($BD55-1)*5)+2,$BE55))","v":""},{"$f":"IF(OR($BD55=\"\",$BE55=\"\"),\"\",INDEX('Uncertainy tables (Beta)'!$G$7:$J$31,(($BD55-1)*5)+3,$BE55))","v":""},{"$f":"IF(OR($BD55=\"\",$BE55=\"\"),\"\",INDEX('Uncertainy tables (Beta)'!$G$7:$J$31,(($BD55-1)*5)+4,$BE55))","v":""},{"$f":"IF(OR($BD55=\"\",$BE55=\"\"),\"\",INDEX('Uncertainy tables (Beta)'!$G$7:$J$31,(($BD55-1)*5)+5,$BE55))","v":""},null,"","",{"$f":"IF(OR($BL55=\"\",$BM55=\"\"),\"\",INDEX('Uncertainy tables (Beta)'!$G$7:$J$31,(($BL55-1)*5)+1,$BM55))","v":""},{"$f":"IF(OR($BL55=\"\",$BM55=\"\"),\"\",INDEX('Uncertainy tables (Beta)'!$G$7:$J$31,(($BL55-1)*5)+2,$BM55))","v":""},{"$f":"IF(OR($BL55=\"\",$BM55=\"\"),\"\",INDEX('Uncertainy tables (Beta)'!$G$7:$J$31,(($BL55-1)*5)+3,$BM55))","v":""},{"$f":"IF(OR($BL55=\"\",$BM55=\"\"),\"\",INDEX('Uncertainy tables (Beta)'!$G$7:$J$31,(($BL55-1)*5)+4,$BM55))","v":""},{"$f":"IF(OR($BL55=\"\",$BM55=\"\"),\"\",INDEX('Uncertainy tables (Beta)'!$G$7:$J$31,(($BL55-1)*5)+5,$BM55))","v":""}]
[]
[]
[]
[]
[]
[]
[]
[]
[{"$f":"IF(OR(ISBLANK('Part A - Exporting'!D7),ISBLANK('Part A - Exporting'!D9),ISBLANK('Part A - Exporting'!D10),ISBLANK('Part A - Exporting'!D11)),\"表C3：整合系统方法措施\",\"表C3：整合来自 \"&'Part A - Exporting'!D9&\" 的\"&'Part A - Exporting'!D7&\" 之上/之中的\"&'Part A - Exporting'!D11&\"的系统方法措施\")","v":"表C3：整合系统方法措施"}]
[null,"拟议的系统方法包的参考名称",null," 措施1"," 措施2"," 措施3"," 措施4"," 措施5"," 措施6"," 措施7"," 措施8"," 措施9"," 措施10"," 措施11"," 措施12"," 措施13"," 措施14"," 措施15"," 措施16"," 措施17"," 措施18"," 措施19"," 措施20"]
[null,"系统方法"]
[null,"目标",null,{"$f":"IF(VLOOKUP(D66,$B$11:$M$30,12,0)=0,\"-\",VLOOKUP(D66,$B$11:$M$30,12,0))","v":{"$error":"#N/A"}},{"$f":"IF(VLOOKUP(E66,$B$11:$M$30,12,0)=0,\"-\",VLOOKUP(E66,$B$11:$M$30,12,0))","v":{"$error":"#N/A"}},{"$error":"#N/A"},{"$error":"#N/A"},{"$error":"#N/A"},{"$error":"#N/A"},{"$error":"#N/A"},{"$error":"#N/A"},{"$error":"#N/A"},{"$error":"#N/A"},{"$error":"#N/A"},{"$error":"#N/A"},{"$error":"#N/A"},{"$error":"#N/A"},{"$error":"#N/A"},{"$error":"#N/A"},{"$error":"#N/A"},{"$error":"#N/A"},{"$error":"#N/A"},{"$error":"#N/A"}]
["指标",{"$f":"$C$8","v":"对降低出口货物中侵染有害生物风险的贡献"},"评分：",{"$f":"IF(VLOOKUP(D$66,$B$11:$M$30,2,0)=0,\"-\",VLOOKUP(D$66,$B$11:$M$30,2,0))","v":{"$error":"#N/A"}},{"$error":"#N/A"},{"$error":"#N/A"},{"$error":"#N/A"},{"$error":"#N/A"},{"$error":"#N/A"},{"$error":"#N/A"},{"$error":"#N/A"},{"$error":"#N/A"},{"$error":"#N/A"},{"$error":"#N/A"},{"$error":"#N/A"},{"$error":"#N/A"},{"$error":"#N/A"},{"$error":"#N/A"},{"$error":"#N/A"},{"$error":"#N/A"},{"$error":"#N/A"},{"$error":"#N/A"},{"$error":"#N/A"}]
[null,null,"不确定度：",{"$f":"IF(VLOOKUP(D$66,$B$11:$M$30,3,0)=0,\"-\",VLOOKUP(D$66,$B$11:$M$30,3,0))","v":{"$error":"#N/A"}},{"$error":"#N/A"},{"$error":"#N/A"},{"$error":"#N/A"},{"$error":"#N/A"},{"$error":"#N/A"},{"$error":"#N/A"},{"$error":"#N/A"},{"$error":"#N/A"},{"$error":"#N/A"},{"$error":"#N/A"},{"$error":"#N/A"},{"$error":"#N/A"},{"$error":"#N/A"},{"$error":"#N/A"},{"$error":"#N/A"},{"$error":"#N/A"},{"$error":"#N/A"},{"$error":"#N/A"},{"$error":"#N/A"}]
[null,{"$f":"$F$8","v":"实施标准"},"评分：",{"$f":"IF(VLOOKUP(D$66,$B$11:$M$30,5,0)=0,\"-\",VLOOKUP(D$66,$B$11:$M$30,5,0))","v":{"$error":"#N/A"}},{"$f":"IF(VLOOKUP(E$66,$B$11:$M$30,5,0)=0,\"-\",VLOOKUP(E$66,$B$11:$M$30,5,0))","v":{"$error":"#N/A"}},{"$error":"#N/A"},{"$error":"#N/A"},{"$error":"#N/A"},{"$error":"#N/A"},{"$error":"#N/A"},{"$error":"#N/A"},{"$error":"#N/A"},{"$error":"#N/A"},{"$error":"#N/A"},{"$error":"#N/A"},{"$error":"#N/A"},{"$error":"#N/A"},{"$error":"#N/A"},{"$error":"#N/A"},{"$error":"#N/A"},{"$error":"#N/A"},{"$error":"#N/A"},{"$error":"#N/A"}]
[null,null,"不确定度：",{"$f":"IF(VLOOKUP(D$66,$B$11:$M$30,6,0)=0,\"-\",VLOOKUP(D$66,$B$11:$M$30,6,0))","v":{"$error":"#N/A"}},{"$f":"IF(VLOOKUP(E$66,$B$11:$M$30,6,0)=0,\"-\",VLOOKUP(E$66,$B$11:$M$30,6,0))","v":{"$error":"#N/A"}},{"$error":"#N/A"},{"$error":"#N/A"},{"$error":"#N/A"},{"$error":"#N/A"},{"$error":"#N/A"},{"$error":"#N/A"},{"$error":"#N/A"},{"$error":"#N/A"},{"$error":"#N/A"},{"$error":"#N/A"},{"$error":"#N/A"},{"$error":"#N/A"},{"$error":"#N/A"},{"$error":"#N/A"},{"$error":"#N/A"},{"$error":"#N/A"},{"$error":"#N/A"},{"$error":"#N/A"}]
[null,{"$f":"$C$33","v":"验证措施对控制点的影响的能力"},"评分：",{"$f":"IF(VLOOKUP(D$66,$B$36:$M$55,2,0)=0,\"-\",VLOOKUP(D$66,$B$36:$M$55,2,0))","v":{"$error":"#N/A"}},{"$f":"IF(VLOOKUP(E$66,$B$36:$M$55,2,0)=0,\"-\",VLOOKUP(E$66,$B$36:$M$55,2,0))","v":{"$error":"#N/A"}},{"$error":"#N/A"},{"$error":"#N/A"},{"$error":"#N/A"},{"$error":"#N/A"},{"$error":"#N/A"},{"$error":"#N/A"},{"$error":"#N/A"},{"$error":"#N/A"},{"$error":"#N/A"},{"$error":"#N/A"},{"$error":"#N/A"},{"$error":"#N/A"},{"$error":"#N/A"},{"$error":"#N/A"},{"$error":"#N/A"},{"$error":"#N/A"},{"$error":"#N/A"},{"$error":"#N/A"}]
[null,null,"不确定度：",{"$f":"IF(VLOOKUP(D$66,$B$36:$M$55,3,0)=0,\"-\",VLOOKUP(D$66,$B$36:$M$55,3,0))","v":{"$error":"#N/A"}},{"$f":"IF(VLOOKUP(E$66,$B$36:$M$55,3,0)=0,\"-\",VLOOKUP(E$66,$B$36:$M$55,3,0))","v":{"$error":"#N/A"}},{"$error":"#N/A"},{"$error":"#N/A"},{"$error":"#N/A"},{"$error":"#N/A"},{"$error":"#N/A"},{"$error":"#N/A"},{"$error":"#N/A"},{"$error":"#N/A"},{"$error":"#N/A"},{"$error":"#N/A"},{"$error":"#N/A"},{"$error":"#N/A"},{"$error":"#N/A"},{"$error":"#N/A"},{"$error":"#N/A"},{"$error":"#N/A"},{"$error":"#N/A"},{"$error":"#N/A"}]
[null,{"$f":"$F$33","v":"生产者可接受度"},"评分：",{"$f":"IF(VLOOKUP(D$66,$B$36:$M$55,5,0)=0,\"-\",VLOOKUP(D$66,$B$36:$M$55,5,0))","v":{"$error":"#N/A"}},{"$f":"IF(VLOOKUP(E$66,$B$36:$M$55,5,0)=0,\"-\",VLOOKUP(E$66,$B$36:$M$55,5,0))","v":{"$error":"#N/A"}},{"$error":"#N/A"},{"$error":"#N/A"},{"$error":"#N/A"},{"$error":"#N/A"},{"$error":"#N/A"},{"$error":"#N/A"},{"$error":"#N/A"},{"$error":"#N/A"},{"$error":"#N/A"},{"$error":"#N/A"},{"$error":"#N/A"},{"$error":"#N/A"},{"$error":"#N/A"},{"$error":"#N/A"},{"$error":"#N/A"},{"$error":"#N/A"},{"$error":"#N/A"},{"$error":"#N/A"}]
[null,null,"不确定度：",{"$f":"IF(VLOOKUP(D$66,$B$36:$M$55,6,0)=0,\"-\",VLOOKUP(D$66,$B$36:$M$55,6,0))","v":{"$error":"#N/A"}},{"$f":"IF(VLOOKUP(E$66,$B$36:$M$55,6,0)=0,\"-\",VLOOKUP(E$66,$B$36:$M$55,6,0))","v":{"$error":"#N/A"}},{"$error":"#N/A"},{"$error":"#N/A"},{"$error":"#N/A"},{"$error":"#N/A"},{"$error":"#N/A"},{"$error":"#N/A"},{"$error":"#N/A"},{"$error":"#N/A"},{"$error":"#N/A"},{"$error":"#N/A"},{"$error":"#N/A"},{"$error":"#N/A"},{"$error":"#N/A"},{"$error":"#N/A"},{"$error":"#N/A"},{"$error":"#N/A"},{"$error":"#N/A"},{"$error":"#N/A"}]
[null,{"$f":"$I$33","v":"行业可接受度"},"评分：",{"$f":"IF(VLOOKUP(D$66,$B$36:$M$55,8,0)=0,\"-\",VLOOKUP(D$66,$B$36:$M$55,8,0))","v":{"$error":"#N/A"}},{"$f":"IF(VLOOKUP(E$66,$B$36:$M$55,8,0)=0,\"-\",VLOOKUP(E$66,$B$36:$M$55,8,0))","v":{"$error":"#N/A"}},{"$error":"#N/A"},{"$error":"#N/A"},{"$error":"#N/A"},{"$error":"#N/A"},{"$error":"#N/A"},{"$error":"#N/A"},{"$error":"#N/A"},{"$error":"#N/A"},{"$error":"#N/A"},{"$error":"#N/A"},{"$error":"#N/A"},{"$error":"#N/A"},{"$error":"#N/A"},{"$error":"#N/A"},{"$error":"#N/A"},{"$error":"#N/A"},{"$error":"#N/A"},{"$error":"#N/A"}]
[null,null,"不确定度：",{"$f":"IF(VLOOKUP(D$66,$B$36:$M$55,9,0)=0,\"-\",VLOOKUP(D$66,$B$36:$M$55,9,0))","v":{"$error":"#N/A"}},{"$f":"IF(VLOOKUP(E$66,$B$36:$M$55,9,0)=0,\"-\",VLOOKUP(E$66,$B$36:$M$55,9,0))","v":{"$error":"#N/A"}},{"$error":"#N/A"},{"$error":"#N/A"},{"$error":"#N/A"},{"$error":"#N/A"},{"$error":"#N/A"},{"$error":"#N/A"},{"$error":"#N/A"},{"$error":"#N/A"},{"$error":"#N/A"},{"$error":"#N/A"},{"$error":"#N/A"},{"$error":"#N/A"},{"$error":"#N/A"},{"$error":"#N/A"},{"$error":"#N/A"},{"$error":"#N/A"},{"$error":"#N/A"},{"$error":"#N/A"}]
[null,{"$f":"$L$33","v":"社会可接受度 "},"评分：",{"$f":"IF(VLOOKUP(D$66,$B$36:$M$55,11,0)=0,\"-\",VLOOKUP(D$66,$B$36:$M$55,11,0))","v":{"$error":"#N/A"}},{"$f":"IF(VLOOKUP(E$66,$B$36:$M$55,11,0)=0,\"-\",VLOOKUP(E$66,$B$36:$M$55,11,0))","v":{"$error":"#N/A"}},{"$error":"#N/A"},{"$error":"#N/A"},{"$error":"#N/A"},{"$error":"#N/A"},{"$error":"#N/A"},{"$error":"#N/A"},{"$error":"#N/A"},{"$error":"#N/A"},{"$error":"#N/A"},{"$error":"#N/A"},{"$error":"#N/A"},{"$error":"#N/A"},{"$error":"#N/A"},{"$error":"#N/A"},{"$error":"#N/A"},{"$error":"#N/A"},{"$error":"#N/A"},{"$error":"#N/A"}]
[null,null,"不确定度：",{"$f":"IF(VLOOKUP(D$66,$B$36:$M$55,12,0)=0,\"-\",VLOOKUP(D$66,$B$36:$M$55,12,0))","v":{"$error":"#N/A"}},{"$f":"IF(VLOOKUP(E$66,$B$36:$M$55,12,0)=0,\"-\",VLOOKUP(E$66,$B$36:$M$55,12,0))","v":{"$error":"#N/A"}},{"$error":"#N/A"},{"$error":"#N/A"},{"$error":"#N/A"},{"$error":"#N/A"},{"$error":"#N/A"},{"$error":"#N/A"},{"$error":"#N/A"},{"$error":"#N/A"},{"$error":"#N/A"},{"$error":"#N/A"},{"$error":"#N/A"},{"$error":"#N/A"},{"$error":"#N/A"},{"$error":"#N/A"},{"$error":"#N/A"},{"$error":"#N/A"},{"$error":"#N/A"},{"$error":"#N/A"}]
[]
[null,null,null,null,null,null,null,null,null,null,null,null,null,null,null,null,null,null,null,null,null,null,null,null,null,null,null,null,null,null,null,null,null,null,null,null,null,null,null,null,null,{"$f":"A82","v":"表C4：系统方法的总体预期绩效"}]
[{"$f":"IF(OR(ISBLANK('Part A - Exporting'!D7),ISBLANK('Part A - Exporting'!D9),ISBLANK('Part A - Exporting'!D10),ISBLANK('Part A - Exporting'!D11)),\"表C4：系统方法的总体预期绩效\",\"表C4.A部分：来自 \"&'Part A - Exporting'!D9&\" 的\"&'Part A - Exporting'!D7&\" 之上/之中的\"&'Part A - Exporting'!D11&\"的系统方法总体预期绩效\")","v":"表C4：系统方法的总体预期绩效"},null,null,null,null,null,null,null,null,null,null,null,null,null,null,null,null,null,null,null,null,null,null,null,null,null,null,null,null,null,null,null,null,null,null,null,null,null,null,null,null,{"$f":"AP83","v":"非常低\t"},{"$f":"AQ83","v":"低"},{"$f":"AR83","v":"中"},{"$f":"AS83","v":"高"},{"$f":"AT83","v":"非常高"}]
[null,"系统方法包","对系统方法的预期整体绩效进行评分",null,null,"其他说明",null,null,null,null,null,null,null,null,null,null,null,null,null,null,null,null,null,null,null,null,null,null,null,null,null,null,null,null,null,null,null,null,null,null,null,{"$f":"AP84","v":"非常低\t"},{"$f":"AQ84","v":"低"},{"$f":"AR84","v":"中"},{"$f":"AS84","v":"高"},{"$f":"AT84","v":"非常高"}]
[null,null,"评分","不确定性","图表","验证措施的方法",null,null,null,null,null,null,null,null,null,null,null,null,null,null,null,null,null,null,null,null,null,null,null,null,null,null,null,null,null,null,null,null,null,"评分","不确定性",{"$f":"A98","v":"非常低\t"},{"$f":"A99","v":"低"},{"$f":"A100","v":"中"},{"$f":"A101","v":"高"},{"$f":"A102","v":"非常高"}]
[null,{"$f":"IF(B66=0,\"\",B66)","v":"系统方法"},null,null,null,null,null,null,null,null,null,null,null,null,null,null,null,null,null,null,null,null,null,null,null,null,null,null,null,null,null,null,null,null,null,null,null,null,null,{"$f":"IF(C85=$A$98,1,IF(C85=$A$99,2,IF(C85=$A$100,3,IF(C85=$A$101,4,IF(C85=$A$102,5,\"\")))))","v":""},{"$f":"IF(D85=$B$98,1,IF(D85=$B$99,2,IF(D85=$B$100,3,IF(D85=$B$101,4,\"\"))))","v":""},{"$f":"IF(OR($AN85=\"\",$AO85=\"\"),\"\",INDEX('Uncertainy tables (Beta)'!$G$7:$J$31,(($AN85-1)*5)+1,$AO85))","v":""},{"$f":"IF(OR($AN85=\"\",$AO85=\"\"),\"\",INDEX('Uncertainy tables (Beta)'!$G$7:$J$31,(($AN85-1)*5)+2,$AO85))","v":""},{"$f":"IF(OR($AN85=\"\",$AO85=\"\"),\"\",INDEX('Uncertainy tables (Beta)'!$G$7:$J$31,(($AN85-1)*5)+3,$AO85))","v":""},{"$f":"IF(OR($AN85=\"\",$AO85=\"\"),\"\",INDEX('Uncertainy tables (Beta)'!$G$7:$J$31,(($AN85-1)*5)+4,$AO85))","v":""},{"$f":"IF(OR($AN85=\"\",$AO85=\"\"),\"\",INDEX('Uncertainy tables (Beta)'!$G$7:$J$31,(($AN85-1)*5)+5,$AO85))","v":""}]
[]
[]
[]
[]
[]
[]
[]
[]
[]
["下拉框文本"]
["评级","不确定性"]
[]
["非常低\t","非常低\t"]
["低","低"]
["中","中"]
["高","高"]
["非常高"]
[]
[]
[]
[]
[]
[null,"页面上的数据条目数",{"$f":"COUNTA(C11:D30,F11:G30,I11:L30,C36:D55,F36:G55,I36:J55,L36:M55,D66:W66,C85:D85,F85:G85)","v":0}]

{"sheet":"Part C - Importing","index":6,"n_rows":108,"n_cols":70,"rows_kept":108,"cut":false,"hidden":false,"merged":[[2,9,2,10],[6,0,6,7],[6,8,6,12],[6,41,6,45],[6,49,6,53],[7,2,7,4],[7,5,7,7],[8,2,8,4],[8,5,8,7],[10,8,10,9],[10,10,10,11],[11,8,11,9],[11,10,11,11],[12,8,12,9],[12,10,12,11],[13,8,13,9],[13,10,13,11],[14,8,14,9],[14,10,14,11],[15,8,15,9],[15,10,15,11],[16,8,16,9],[16,10,16,11],[17,8,17,9],[17,10,17,11],[18,8,18,9],[18,10,18,11],[19,8,19,9],[19,10,19,11],[20,8,20,9],[20,10,20,11],[21,8,21,9],[21,10,21,11],[22,8,22,9],[22,10,22,11],[23,8,23,9],[23,10,23,11],[24,8,24,9],[24,10,24,11],[25,8,25,9],[25,10,25,11],[26,8,26,9],[26,10,26,11],[27,8,27,9],[27,10,27,11],[28,8,28,9],[28,10,28,11],[29,8,29,9],[29,10,29,11],[31,0,31,13],[32,2,32,4],[32,5,32,7],[32,8,32,10],[32,11,32,13],[32,41,32,45],[32,49,32,53],[32,55,32,61],[32,65,32,69],[33,2,33,4],[33,5,33,7],[33,8,33,10],[33,11,33,13],[63,0,63,22],[64,1,64,2],[65,1,65,2],[66,1,66,2],[80,41,80,45],[81,0,81,6],[82,2,82,4],[84,5,84,6],[7,0,9,0],[32,0,33,0],[67,0,78,0],[7,1,9,1],[32,1,33,1],[67,1,68,1],[69,1,70,1],[71,1,72,1],[73,1,74,1],[75,1,76,1],[77,1,78,1],[7,12,9,12],[82,5,83,6],[7,8,9,9],[7,10,9,11]]}
[null,{"$f":"Main!B1","v":"全球超越合规 — 系统方法决策支持（DSSA）"}]
[null,{"$f":"IF(OR(ISBLANK('Part A - Importing'!D7),ISBLANK('Part A - Importing'!D9),ISBLANK('Part A - Importing'!D10),ISBLANK('Part A - Importing'!D11)),\"C部分：制定系统方法的评价措施\",\"C部分：为开发从 \"&'Part A - Importing'!D9&\" 到 \"&'Part A - Importing'!D10&\"的\"&'Part A - Importing'!D7&\" 贸易系统方法的措施评价-针对\"&'Part A - Importing'!D11)","v":"C部分：制定系统方法的评价措施"}]
[null,"进口版本"]
[]
[]
[]
["表C1.措施指标（降低有害生物风险和实施标准）",null,null,null,null,null,null,null,"可选说明",null,null,null,null,null,null,null,null,null,null,null,null,null,null,null,null,null,null,null,null,null,null,null,null,null,null,null,null,null,null,null,null,{"$f":"C8","v":"对降低出口货物中侵染有害生物风险的贡献"},null,null,null,null,null,null,null,{"$f":"F8","v":"实施标准"}]
[null,"可用的系统方法措施（来自B部分）","对降低出口货物中侵染有害生物风险的贡献",null,null,"实施标准",null,null,"与其他措施的互动",null,"说明",null,"措施目标",null,null,null,null,null,null,null,null,null,null,null,null,null,null,null,null,null,null,null,null,null,null,null,null,null,null,null,null,{"$f":"AP9","v":"非常低\t"},{"$f":"AQ9","v":"低"},{"$f":"AR9","v":"中"},{"$f":"AS9","v":"高"},{"$f":"AT9","v":"非常高"},null,null,null,{"$f":"AX9","v":"非常低\t"},{"$f":"AY9","v":"低"},{"$f":"AZ9","v":"中"},{"$f":"BA9","v":"高"},{"$f":"BB9","v":"非常高"}]
[null,null,"该措施对降低有害生物风险的最大贡献是： ",null,null,"该措施实地实施标准是：",null,null,null,null,null,null,null,null,null,null,null,null,null,null,null,null,null,null,null,null,null,null,null,null,null,null,null,null,null,null,null,null,null,null,null,{"$f":"AP10","v":"非常低\t"},{"$f":"AQ10","v":"低"},"中","高","非常高",null,null,null,{"$f":"AX10","v":"非常低\t"},{"$f":"AY10","v":"低"},{"$f":"AZ10","v":"中"},{"$f":"BA10","v":"高"},{"$f":"BB10","v":"非常高"}]
[null,null,"评分","不确定性","图表","评分","不确定性","图表",null,null,null,null,null,null,null,null,null,null,null,null,null,null,null,null,null,null,null,null,null,null,null,null,null,null,null,null,null,null,null,"评分","不确定性",{"$f":"A98","v":"非常低\t"},{"$f":"A99","v":"低"},{"$f":"A100","v":"中"},{"$f":"A101","v":"高"},{"$f":"A102","v":"非常高"},null,"评分","不确定性",{"$f":"A98","v":"非常低\t"},{"$f":"A99","v":"低"},{"$f":"A100","v":"中"},{"$f":"A101","v":"高"},{"$f":"A102","v":"非常高"}]
["i",{"$f":"IF('Part B - Importing'!B52=0,\"\",'Part B - Importing'!B52)","v":"输华樱桃果园、设施审核批准注册"},null,null,null,null,null,null,null,null,null,null,{"$f":"IF('Part B - Importing'!C52=0,\"\",'Part B - Importing'!C52)","v":""},null,null,null,null,null,null,null,null,null,null,null,null,null,null,null,null,null,null,null,null,null,null,null,null,null,1,{"$f":"IF(C11=$A$98,1,IF(C11=$A$99,2,IF(C11=$A$100,3,IF(C11=$A$101,4,IF(C11=$A$102,5,\"\")))))","v":""},{"$f":"IF(D11=$B$98,1,IF(D11=$B$99,2,IF(D11=$B$100,3,IF(D11=$B$101,4,\"\"))))","v":""},{"$f":"IF(OR($AN11=\"\",$AO11=\"\"),\"\",INDEX('Uncertainy tables (Beta)'!$G$7:$J$31,(($AN11-1)*5)+1,$AO11))","v":""},{"$f":"IF(OR($AN11=\"\",$AO11=\"\"),\"\",INDEX('Uncertainy tables (Beta)'!$G$7:$J$31,(($AN11-1)*5)+2,$AO11))","v":""},{"$f":"IF(OR($AN11=\"\",$AO11=\"\"),\"\",INDEX('Uncertainy tables (Beta)'!$G$7:$J$31,(($AN11-1)*5)+3,$AO11))","v":""},{"$f":"IF(OR($AN11=\"\",$AO11=\"\"),\"\",INDEX('Uncertainy tables (Beta)'!$G$7:$J$31,(($AN11-1)*5)+4,$AO11))","v":""},{"$f":"IF(OR($AN11=\"\",$AO11=\"\"),\"\",INDEX('Uncertainy tables (Beta)'!$G$7:$J$31,(($AN11-1)*5)+5,$AO11))","v":""},null,{"$f":"IF(F11=$A$98,1,IF(F11=$A$99,2,IF(F11=$A$100,3,IF(F11=$A$101,4,IF(F11=$A$102,5,\"\")))))","v":""},{"$f":"IF(G11=$B$98,1,IF(G11=$B$99,2,IF(G11=$B$100,3,IF(G11=$B$101,4,\"\"))))","v":""},{"$f":"IF(OR($AV11=\"\",$AW11=\"\"),\"\",INDEX('Uncertainy tables (Beta)'!$G$7:$J$31,(($AV11-1)*5)+1,$AW11))","v":""},{"$f":"IF(OR($AV11=\"\",$AW11=\"\"),\"\",INDEX('Uncertainy tables (Beta)'!$G$7:$J$31,(($AV11-1)*5)+2,$AW11))","v":""},{"$f":"IF(OR($AV11=\"\",$AW11=\"\"),\"\",INDEX('Uncertainy tables (Beta)'!$G$7:$J$31,(($AV11-1)*5)+3,$AW11))","v":""},{"$f":"IF(OR($AV11=\"\",$AW11=\"\"),\"\",INDEX('Uncertainy tables (Beta)'!$G$7:$J$31,(($AV11-1)*5)+4,$AW11))","v":""},{"$f":"IF(OR($AV11=\"\",$AW11=\"\"),\"\",INDEX('Uncertainy tables (Beta)'!$G$7:$J$31,(($AV11-1)*5)+5,$AW11))","v":""}]
["ii",{"$f":"IF('Part B - Importing'!B53=0,\"\",'Part B - Importing'!B53)","v":"输华樱桃果园内不得种植其他植物。"},null,null,null,null,null,null,null,null,null,null,{"$f":"IF('Part B - Importing'!C53=0,\"\",'Part B - Importing'!C53)","v":""},null,null,null,null,null,null,null,null,null,null,null,null,null,null,null,null,null,null,null,null,null,null,null,null,null,{"$f":"AM11+1","v":2},{"$f":"IF(C12=$A$98,1,IF(C12=$A$99,2,IF(C12=$A$100,3,IF(C12=$A$101,4,IF(C12=$A$102,5,\"\")))))","v":""},"",{"$f":"IF(OR($AN12=\"\",$AO12=\"\"),\"\",INDEX('Uncertainy tables (Beta)'!$G$7:$J$31,(($AN12-1)*5)+1,$AO12))","v":""},{"$f":"IF(OR($AN12=\"\",$AO12=\"\"),\"\",INDEX('Uncertainy tables (Beta)'!$G$7:$J$31,(($AN12-1)*5)+2,$AO12))","v":""},{"$f":"IF(OR($AN12=\"\",$AO12=\"\"),\"\",INDEX('Uncertainy tables (Beta)'!$G$7:$J$31,(($AN12-1)*5)+3,$AO12))","v":""},{"$f":"IF(OR($AN12=\"\",$AO12=\"\"),\"\",INDEX('Uncertainy tables (Beta)'!$G$7:$J$31,(($AN12-1)*5)+4,$AO12))","v":""},{"$f":"IF(OR($AN12=\"\",$AO12=\"\"),\"\",INDEX('Uncertainy tables (Beta)'!$G$7:$J$31,(($AN12-1)*5)+5,$AO12))","v":""},null,"","",{"$f":"IF(OR($AV12=\"\",$AW12=\"\"),\"\",INDEX('Uncertainy tables (Beta)'!$G$7:$J$31,(($AV12-1)*5)+1,$AW12))","v":""},{"$f":"IF(OR($AV12=\"\",$AW12=\"\"),\"\",INDEX('Uncertainy tables (Beta)'!$G$7:$J$31,(($AV12-1)*5)+2,$AW12))","v":""},{"$f":"IF(OR($AV12=\"\",$AW12=\"\"),\"\",INDEX('Uncertainy tables (Beta)'!$G$7:$J$31,(($AV12-1)*5)+3,$AW12))","v":""},{"$f":"IF(OR($AV12=\"\",$AW12=\"\"),\"\",INDEX('Uncertainy tables (Beta)'!$G$7:$J$31,(($AV12-1)*5)+4,$AW12))","v":""},{"$f":"IF(OR($AV12=\"\",$AW12=\"\"),\"\",INDEX('Uncertainy tables (Beta)'!$G$7:$J$31,(($AV12-1)*5)+5,$AW12))","v":""}]
["iii",{"$f":"IF('Part B - Importing'!B54=0,\"\",'Part B - Importing'!B54)","v":"输华樱桃必须来自苹果蠹蛾的非疫生产点（PFPSs）并采取有效的预防控制措施，非疫生产点的建立应遵循ISPM10的原则。"},null,null,null,null,null,null,null,null,null,null,{"$f":"IF('Part B - Importing'!C54=0,\"\",'Part B - Importing'!C54)","v":""},null,null,null,null,null,null,null,null,null,null,null,null,null,null,null,null,null,null,null,null,null,null,null,null,null,{"$f":"AM12+1","v":3},"","",{"$f":"IF(OR($AN13=\"\",$AO13=\"\"),\"\",INDEX('Uncertainy tables (Beta)'!$G$7:$J$31,(($AN13-1)*5)+1,$AO13))","v":""},{"$f":"IF(OR($AN13=\"\",$AO13=\"\"),\"\",INDEX('Uncertainy tables (Beta)'!$G$7:$J$31,(($AN13-1)*5)+2,$AO13))","v":""},{"$f":"IF(OR($AN13=\"\",$AO13=\"\"),\"\",INDEX('Uncertainy tables (Beta)'!$G$7:$J$31,(($AN13-1)*5)+3,$AO13))","v":""},{"$f":"IF(OR($AN13=\"\",$AO13=\"\"),\"\",INDEX('Uncertainy tables (Beta)'!$G$7:$J$31,(($AN13-1)*5)+4,$AO13))","v":""},{"$f":"IF(OR($AN13=\"\",$AO13=\"\"),\"\",INDEX('Uncertainy tables (Beta)'!$G$7:$J$31,(($AN13-1)*5)+5,$AO13))","v":""},null,"","",{"$f":"IF(OR($AV13=\"\",$AW13=\"\"),\"\",INDEX('Uncertainy tables (Beta)'!$G$7:$J$31,(($AV13-1)*5)+1,$AW13))","v":""},{"$f":"IF(OR($AV13=\"\",$AW13=\"\"),\"\",INDEX('Uncertainy tables (Beta)'!$G$7:$J$31,(($AV13-1)*5)+2,$AW13))","v":""},{"$f":"IF(OR($AV13=\"\",$AW13=\"\"),\"\",INDEX('Uncertainy tables (Beta)'!$G$7:$J$31,(($AV13-1)*5)+3,$AW13))","v":""},{"$f":"IF(OR($AV13=\"\",$AW13=\"\"),\"\",INDEX('Uncertainy tables (Beta)'!$G$7:$J$31,(($AV13-1)*5)+4,$AW13))","v":""},{"$f":"IF(OR($AV13=\"\",$AW13=\"\"),\"\",INDEX('Uncertainy tables (Beta)'!$G$7:$J$31,(($AV13-1)*5)+5,$AW13))","v":""}]
["iv",{"$f":"IF('Part B - Importing'!B55=0,\"\",'Part B - Importing'!B55)","v":"培训技术人员"},null,null,null,null,null,null,null,null,null,null,{"$f":"IF('Part B - Importing'!C55=0,\"\",'Part B - Importing'!C55)","v":""},null,null,null,null,null,null,null,null,null,null,null,null,null,null,null,null,null,null,null,null,null,null,null,null,null,4,"","",{"$f":"IF(OR($AN14=\"\",$AO14=\"\"),\"\",INDEX('Uncertainy tables (Beta)'!$G$7:$J$31,(($AN14-1)*5)+1,$AO14))","v":""},{"$f":"IF(OR($AN14=\"\",$AO14=\"\"),\"\",INDEX('Uncertainy tables (Beta)'!$G$7:$J$31,(($AN14-1)*5)+2,$AO14))","v":""},{"$f":"IF(OR($AN14=\"\",$AO14=\"\"),\"\",INDEX('Uncertainy tables (Beta)'!$G$7:$J$31,(($AN14-1)*5)+3,$AO14))","v":""},{"$f":"IF(OR($AN14=\"\",$AO14=\"\"),\"\",INDEX('Uncertainy tables (Beta)'!$G$7:$J$31,(($AN14-1)*5)+4,$AO14))","v":""},{"$f":"IF(OR($AN14=\"\",$AO14=\"\"),\"\",INDEX('Uncertainy tables (Beta)'!$G$7:$J$31,(($AN14-1)*5)+5,$AO14))","v":""},null,"","",{"$f":"IF(OR($AV14=\"\",$AW14=\"\"),\"\",INDEX('Uncertainy tables (Beta)'!$G$7:$J$31,(($AV14-1)*5)+1,$AW14))","v":""},{"$f":"IF(OR($AV14=\"\",$AW14=\"\"),\"\",INDEX('Uncertainy tables (Beta)'!$G$7:$J$31,(($AV14-1)*5)+2,$AW14))","v":""},{"$f":"IF(OR($AV14=\"\",$AW14=\"\"),\"\",INDEX('Uncertainy tables (Beta)'!$G$7:$J$31,(($AV14-1)*5)+3,$AW14))","v":""},{"$f":"IF(OR($AV14=\"\",$AW14=\"\"),\"\",INDEX('Uncertainy tables (Beta)'!$G$7:$J$31,(($AV14-1)*5)+4,$AW14))","v":""},{"$f":"IF(OR($AV14=\"\",$AW14=\"\"),\"\",INDEX('Uncertainy tables (Beta)'!$G$7:$J$31,(($AV14-1)*5)+5,$AW14))","v":""}]
["v",{"$f":"IF('Part B - Importing'!B56=0,\"\",'Part B - Importing'!B56)","v":"施良好农业规范（GAP）、执行有害生物综合防治（IPM）"},null,null,null,null,null,null,null,null,null,null,{"$f":"IF('Part B - Importing'!C56=0,\"\",'Part B - Importing'!C56)","v":""},null,null,null,null,null,null,null,null,null,null,null,null,null,null,null,null,null,null,null,null,null,null,null,null,null,5,"","",{"$f":"IF(OR($AN15=\"\",$AO15=\"\"),\"\",INDEX('Uncertainy tables (Beta)'!$G$7:$J$31,(($AN15-1)*5)+1,$AO15))","v":""},{"$f":"IF(OR($AN15=\"\",$AO15=\"\"),\"\",INDEX('Uncertainy tables (Beta)'!$G$7:$J$31,(($AN15-1)*5)+2,$AO15))","v":""},{"$f":"IF(OR($AN15=\"\",$AO15=\"\"),\"\",INDEX('Uncertainy tables (Beta)'!$G$7:$J$31,(($AN15-1)*5)+3,$AO15))","v":""},{"$f":"IF(OR($AN15=\"\",$AO15=\"\"),\"\",INDEX('Uncertainy tables (Beta)'!$G$7:$J$31,(($AN15-1)*5)+4,$AO15))","v":""},{"$f":"IF(OR($AN15=\"\",$AO15=\"\"),\"\",INDEX('Uncertainy tables (Beta)'!$G$7:$J$31,(($AN15-1)*5)+5,$AO15))","v":""},null,"","",{"$f":"IF(OR($AV15=\"\",$AW15=\"\"),\"\",INDEX('Uncertainy tables (Beta)'!$G$7:$J$31,(($AV15-1)*5)+1,$AW15))","v":""},{"$f":"IF(OR($AV15=\"\",$AW15=\"\"),\"\",INDEX('Uncertainy tables (Beta)'!$G$7:$J$31,(($AV15-1)*5)+2,$AW15))","v":""},{"$f":"IF(OR($AV15=\"\",$AW15=\"\"),\"\",INDEX('Uncertainy tables (Beta)'!$G$7:$J$31,(($AV15-1)*5)+3,$AW15))","v":""},{"$f":"IF(OR($AV15=\"\",$AW15=\"\"),\"\",INDEX('Uncertainy tables (Beta)'!$G$7:$J$31,(($AV15-1)*5)+4,$AW15))","v":""},{"$f":"IF(OR($AV15=\"\",$AW15=\"\"),\"\",INDEX('Uncertainy tables (Beta)'!$G$7:$J$31,(($AV15-1)*5)+5,$AW15))","v":""}]
["vi",{"$f":"IF('Part B - Importing'!B57=0,\"\",'Part B - Importing'!B57)","v":"果园监控：对苹果蠹蛾的监测调查从盛花期开始，一直到樱桃的包装工作结束。"},null,null,null,null,null,null,null,null,null,null,{"$f":"IF('Part B - Importing'!C57=0,\"\",'Part B - Importing'!C57)","v":""},null,null,null,null,null,null,null,null,null,null,null,null,null,null,null,null,null,null,null,null,null,null,null,null,null,6,"","",{"$f":"IF(OR($AN16=\"\",$AO16=\"\"),\"\",INDEX('Uncertainy tables (Beta)'!$G$7:$J$31,(($AN16-1)*5)+1,$AO16))","v":""},{"$f":"IF(OR($AN16=\"\",$AO16=\"\"),\"\",INDEX('Uncertainy tables (Beta)'!$G$7:$J$31,(($AN16-1)*5)+2,$AO16))","v":""},{"$f":"IF(OR($AN16=\"\",$AO16=\"\"),\"\",INDEX('Uncertainy tables (Beta)'!$G$7:$J$31,(($AN16-1)*5)+3,$AO16))","v":""},{"$f":"IF(OR($AN16=\"\",$AO16=\"\"),\"\",INDEX('Uncertainy tables (Beta)'!$G$7:$J$31,(($AN16-1)*5)+4,$AO16))","v":""},{"$f":"IF(OR($AN16=\"\",$AO16=\"\"),\"\",INDEX('Uncertainy tables (Beta)'!$G$7:$J$31,(($AN16-1)*5)+5,$AO16))","v":""},null,"","",{"$f":"IF(OR($AV16=\"\",$AW16=\"\"),\"\",INDEX('Uncertainy tables (Beta)'!$G$7:$J$31,(($AV16-1)*5)+1,$AW16))","v":""},{"$f":"IF(OR($AV16=\"\",$AW16=\"\"),\"\",INDEX('Uncertainy tables (Beta)'!$G$7:$J$31,(($AV16-1)*5)+2,$AW16))","v":""},{"$f":"IF(OR($AV16=\"\",$AW16=\"\"),\"\",INDEX('Uncertainy tables (Beta)'!$G$7:$J$31,(($AV16-1)*5)+3,$AW16))","v":""},{"$f":"IF(OR($AV16=\"\",$AW16=\"\"),\"\",INDEX('Uncertainy tables (Beta)'!$G$7:$J$31,(($AV16-1)*5)+4,$AW16))","v":""},{"$f":"IF(OR($AV16=\"\",$AW16=\"\"),\"\",INDEX('Uncertainy tables (Beta)'!$G$7:$J$31,(($AV16-1)*5)+5,$AW16))","v":""}]
["vii",{"$f":"IF('Part B - Importing'!B58=0,\"\",'Part B - Importing'!B58)","v":"果园监控：对苹果蠹蛾的监测调查从盛花期开始，一直到樱桃的包装工作结束。"},null,null,null,null,null,null,null,null,null,null,{"$f":"IF('Part B - Importing'!C58=0,\"\",'Part B - Importing'!C58)","v":""},null,null,null,null,null,null,null,null,null,null,null,null,null,null,null,null,null,null,null,null,null,null,null,null,null,7,"","",{"$f":"IF(OR($AN17=\"\",$AO17=\"\"),\"\",INDEX('Uncertainy tables (Beta)'!$G$7:$J$31,(($AN17-1)*5)+1,$AO17))","v":""},{"$f":"IF(OR($AN17=\"\",$AO17=\"\"),\"\",INDEX('Uncertainy tables (Beta)'!$G$7:$J$31,(($AN17-1)*5)+2,$AO17))","v":""},{"$f":"IF(OR($AN17=\"\",$AO17=\"\"),\"\",INDEX('Uncertainy tables (Beta)'!$G$7:$J$31,(($AN17-1)*5)+3,$AO17))","v":""},{"$f":"IF(OR($AN17=\"\",$AO17=\"\"),\"\",INDEX('Uncertainy tables (Beta)'!$G$7:$J$31,(($AN17-1)*5)+4,$AO17))","v":""},{"$f":"IF(OR($AN17=\"\",$AO17=\"\"),\"\",INDEX('Uncertainy tables (Beta)'!$G$7:$J$31,(($AN17-1)*5)+5,$AO17))","v":""},null,"","",{"$f":"IF(OR($AV17=\"\",$AW17=\"\"),\"\",INDEX('Uncertainy tables (Beta)'!$G$7:$J$31,(($AV17-1)*5)+1,$AW17))","v":""},{"$f":"IF(OR($AV17=\"\",$AW17=\"\"),\"\",INDEX('Uncertainy tables (Beta)'!$G$7:$J$31,(($AV17-1)*5)+2,$AW17))","v":""},{"$f":"IF(OR($AV17=\"\",$AW17=\"\"),\"\",INDEX('Uncertainy tables (Beta)'!$G$7:$J$31,(($AV17-1)*5)+3,$AW17))","v":""},{"$f":"IF(OR($AV17=\"\",$AW17=\"\"),\"\",INDEX('Uncertainy tables (Beta)'!$G$7:$J$31,(($AV17-1)*5)+4,$AW17))","v":""},{"$f":"IF(OR($AV17=\"\",$AW17=\"\"),\"\",INDEX('Uncertainy tables (Beta)'!$G$7:$J$31,(($AV17-1)*5)+5,$AW17))","v":""}]
["viii",{"$f":"IF('Part B - Importing'!B59=0,\"\",'Part B - Importing'!B59)","v":"输华樱桃加工、包装、储藏和装运过程，须在乌方或乌方授权人员检疫监管下进行。"},null,null,null,null,null,null,null,null,null,null,{"$f":"IF('Part B - Importing'!C59=0,\"\",'Part B - Importing'!C59)","v":""},null,null,null,null,null,null,null,null,null,null,null,null,null,null,null,null,null,null,null,null,null,null,null,null,null,8,"","",{"$f":"IF(OR($AN18=\"\",$AO18=\"\"),\"\",INDEX('Uncertainy tables (Beta)'!$G$7:$J$31,(($AN18-1)*5)+1,$AO18))","v":""},{"$f":"IF(OR($AN18=\"\",$AO18=\"\"),\"\",INDEX('Uncertainy tables (Beta)'!$G$7:$J$31,(($AN18-1)*5)+2,$AO18))","v":""},{"$f":"IF(OR($AN18=\"\",$AO18=\"\"),\"\",INDEX('Uncertainy tables (Beta)'!$G$7:$J$31,(($AN18-1)*5)+3,$AO18))","v":""},{"$f":"IF(OR($AN18=\"\",$AO18=\"\"),\"\",INDEX('Uncertainy tables (Beta)'!$G$7:$J$31,(($AN18-1)*5)+4,$AO18))","v":""},{"$f":"IF(OR($AN18=\"\",$AO18=\"\"),\"\",INDEX('Uncertainy tables (Beta)'!$G$7:$J$31,(($AN18-1)*5)+5,$AO18))","v":""},null,"","",{"$f":"IF(OR($AV18=\"\",$AW18=\"\"),\"\",INDEX('Uncertainy tables (Beta)'!$G$7:$J$31,(($AV18-1)*5)+1,$AW18))","v":""},{"$f":"IF(OR($AV18=\"\",$AW18=\"\"),\"\",INDEX('Uncertainy tables (Beta)'!$G$7:$J$31,(($AV18-1)*5)+2,$AW18))","v":""},{"$f":"IF(OR($AV18=\"\",$AW18=\"\"),\"\",INDEX('Uncertainy tables (Beta)'!$G$7:$J$31,(($AV18-1)*5)+3,$AW18))","v":""},{"$f":"IF(OR($AV18=\"\",$AW18=\"\"),\"\",INDEX('Uncertainy tables (Beta)'!$G$7:$J$31,(($AV18-1)*5)+4,$AW18))","v":""},{"$f":"IF(OR($AV18=\"\",$AW18=\"\"),\"\",INDEX('Uncertainy tables (Beta)'!$G$7:$J$31,(($AV18-1)*5)+5,$AW18))","v":""}]
["ix",{"$f":"IF('Part B - Importing'!B60=0,\"\",'Part B - Importing'!B60)","v":"在加工、包装过程中，须对樱桃进行挑选、分拣和处理，以保证输华的樱桃不带有昆虫、螨类、烂果及枝、叶、根和土壤。"},null,null,null,null,null,null,null,null,null,null,{"$f":"IF('Part B - Importing'!C60=0,\"\",'Part B - Importing'!C60)","v":""},null,null,null,null,null,null,null,null,null,null,null,null,null,null,null,null,null,null,null,null,null,null,null,null,null,9,"","",{"$f":"IF(OR($AN19=\"\",$AO19=\"\"),\"\",INDEX('Uncertainy tables (Beta)'!$G$7:$J$31,(($AN19-1)*5)+1,$AO19))","v":""},{"$f":"IF(OR($AN19=\"\",$AO19=\"\"),\"\",INDEX('Uncertainy tables (Beta)'!$G$7:$J$31,(($AN19-1)*5)+2,$AO19))","v":""},{"$f":"IF(OR($AN19=\"\",$AO19=\"\"),\"\",INDEX('Uncertainy tables (Beta)'!$G$7:$J$31,(($AN19-1)*5)+3,$AO19))","v":""},{"$f":"IF(OR($AN19=\"\",$AO19=\"\"),\"\",INDEX('Uncertainy tables (Beta)'!$G$7:$J$31,(($AN19-1)*5)+4,$AO19))","v":""},{"$f":"IF(OR($AN19=\"\",$AO19=\"\"),\"\",INDEX('Uncertainy tables (Beta)'!$G$7:$J$31,(($AN19-1)*5)+5,$AO19))","v":""},null,"","",{"$f":"IF(OR($AV19=\"\",$AW19=\"\"),\"\",INDEX('Uncertainy tables (Beta)'!$G$7:$J$31,(($AV19-1)*5)+1,$AW19))","v":""},{"$f":"IF(OR($AV19=\"\",$AW19=\"\"),\"\",INDEX('Uncertainy tables (Beta)'!$G$7:$J$31,(($AV19-1)*5)+2,$AW19))","v":""},{"$f":"IF(OR($AV19=\"\",$AW19=\"\"),\"\",INDEX('Uncertainy tables (Beta)'!$G$7:$J$31,(($AV19-1)*5)+3,$AW19))","v":""},{"$f":"IF(OR($AV19=\"\",$AW19=\"\"),\"\",INDEX('Uncertainy tables (Beta)'!$G$7:$J$31,(($AV19-1)*5)+4,$AW19))","v":""},{"$f":"IF(OR($AV19=\"\",$AW19=\"\"),\"\",INDEX('Uncertainy tables (Beta)'!$G$7:$J$31,(($AV19-1)*5)+5,$AW19))","v":""}]
["x",{"$f":"IF('Part B - Importing'!B61=0,\"\",'Part B - Importing'!B61)","v":"对输华樱桃要使用专门的包装线，不得同时包装其他水果，避免被有害生物污染。"},null,null,null,null,null,null,null,null,null,null,{"$f":"IF('Part B - Importing'!C61=0,\"\",'Part B - Importing'!C61)","v":""},null,null,null,null,null,null,null,null,null,null,null,null,null,null,null,null,null,null,null,null,null,null,null,null,null,10,"","",{"$f":"IF(OR($AN20=\"\",$AO20=\"\"),\"\",INDEX('Uncertainy tables (Beta)'!$G$7:$J$31,(($AN20-1)*5)+1,$AO20))","v":""},{"$f":"IF(OR($AN20=\"\",$AO20=\"\"),\"\",INDEX('Uncertainy tables (Beta)'!$G$7:$J$31,(($AN20-1)*5)+2,$AO20))","v":""},{"$f":"IF(OR($AN20=\"\",$AO20=\"\"),\"\",INDEX('Uncertainy tables (Beta)'!$G$7:$J$31,(($AN20-1)*5)+3,$AO20))","v":""},{"$f":"IF(OR($AN20=\"\",$AO20=\"\"),\"\",INDEX('Uncertainy tables (Beta)'!$G$7:$J$31,(($AN20-1)*5)+4,$AO20))","v":""},{"$f":"IF(OR($AN20=\"\",$AO20=\"\"),\"\",INDEX('Uncertainy tables (Beta)'!$G$7:$J$31,(($AN20-1)*5)+5,$AO20))","v":""},null,"","",{"$f":"IF(OR($AV20=\"\",$AW20=\"\"),\"\",INDEX('Uncertainy tables (Beta)'!$G$7:$J$31,(($AV20-1)*5)+1,$AW20))","v":""},{"$f":"IF(OR($AV20=\"\",$AW20=\"\"),\"\",INDEX('Uncertainy tables (Beta)'!$G$7:$J$31,(($AV20-1)*5)+2,$AW20))","v":""},{"$f":"IF(OR($AV20=\"\",$AW20=\"\"),\"\",INDEX('Uncertainy tables (Beta)'!$G$7:$J$31,(($AV20-1)*5)+3,$AW20))","v":""},{"$f":"IF(OR($AV20=\"\",$AW20=\"\"),\"\",INDEX('Uncertainy tables (Beta)'!$G$7:$J$31,(($AV20-1)*5)+4,$AW20))","v":""},{"$f":"IF(OR($AV20=\"\",$AW20=\"\"),\"\",INDEX('Uncertainy tables (Beta)'!$G$7:$J$31,(($AV20-1)*5)+5,$AW20))","v":""}]
["xi",{"$f":"IF('Part B - Importing'!B62=0,\"\",'Part B - Importing'!B62)","v":"包装好的樱桃应单独储藏，避免受有害生物再感染。樱桃包装箱上应用英文标出水果名称、产地（地区和万户（Tuman））、果园和包装厂及其注册号。每个出口托盘包装上应有经MAWR确认的检疫标识。每个包装箱和托盘需用中文标出“输往中华人民共和国”。\n樱桃包装材料应干净卫生、未使用过，符合中国有关植物检疫要求。"},null,null,null,null,null,null,null,null,null,null,{"$f":"IF('Part B - Importing'!C62=0,\"\",'Part B - Importing'!C62)","v":""},null,null,null,null,null,null,null,null,null,null,null,null,null,null,null,null,null,null,null,null,null,null,null,null,null,11,"","",{"$f":"IF(OR($AN21=\"\",$AO21=\"\"),\"\",INDEX('Uncertainy tables (Beta)'!$G$7:$J$31,(($AN21-1)*5)+1,$AO21))","v":""},{"$f":"IF(OR($AN21=\"\",$AO21=\"\"),\"\",INDEX('Uncertainy tables (Beta)'!$G$7:$J$31,(($AN21-1)*5)+2,$AO21))","v":""},{"$f":"IF(OR($AN21=\"\",$AO21=\"\"),\"\",INDEX('Uncertainy tables (Beta)'!$G$7:$J$31,(($AN21-1)*5)+3,$AO21))","v":""},{"$f":"IF(OR($AN21=\"\",$AO21=\"\"),\"\",INDEX('Uncertainy tables (Beta)'!$G$7:$J$31,(($AN21-1)*5)+4,$AO21))","v":""},{"$f":"IF(OR($AN21=\"\",$AO21=\"\"),\"\",INDEX('Uncertainy tables (Beta)'!$G$7:$J$31,(($AN21-1)*5)+5,$AO21))","v":""},null,"","",{"$f":"IF(OR($AV21=\"\",$AW21=\"\"),\"\",INDEX('Uncertainy tables (Beta)'!$G$7:$J$31,(($AV21-1)*5)+1,$AW21))","v":""},{"$f":"IF(OR($AV21=\"\",$AW21=\"\"),\"\",INDEX('Uncertainy tables (Beta)'!$G$7:$J$31,(($AV21-1)*5)+2,$AW21))","v":""},{"$f":"IF(OR($AV21=\"\",$AW21=\"\"),\"\",INDEX('Uncertainy tables (Beta)'!$G$7:$J$31,(($AV21-1)*5)+3,$AW21))","v":""},{"$f":"IF(OR($AV21=\"\",$AW21=\"\"),\"\",INDEX('Uncertainy tables (Beta)'!$G$7:$J$31,(($AV21-1)*5)+4,$AW21))","v":""},{"$f":"IF(OR($AV21=\"\",$AW21=\"\"),\"\",INDEX('Uncertainy tables (Beta)'!$G$7:$J$31,(($AV21-1)*5)+5,$AW21))","v":""}]
["xii",{"$f":"IF('Part B - Importing'!B63=0,\"\",'Part B - Importing'!B63)","v":"议定书实施的前两年，MAWR人员需按2%的抽样比例对输华樱桃实施出口检验检疫，最小取样量不得少于1200果，并对其中可疑果进行剖果检查。如果未发现检疫问题，此后抽样比例降低到1%，最小取样量不得少于600果。如果在出口检验检疫中，检出欧洲樱桃实蝇、葡萄花翅小卷蛾和苹果蠹蛾，MAWR将在本出口季节暂停该万户（Tuman）向中国出口，并通报AQSIQ。"},null,null,null,null,null,null,null,null,null,null,{"$f":"IF('Part B - Importing'!C63=0,\"\",'Part B - Importing'!C63)","v":""},null,null,null,null,null,null,null,null,null,null,null,null,null,null,null,null,null,null,null,null,null,null,null,null,null,12,"","",{"$f":"IF(OR($AN22=\"\",$AO22=\"\"),\"\",INDEX('Uncertainy tables (Beta)'!$G$7:$J$31,(($AN22-1)*5)+1,$AO22))","v":""},{"$f":"IF(OR($AN22=\"\",$AO22=\"\"),\"\",INDEX('Uncertainy tables (Beta)'!$G$7:$J$31,(($AN22-1)*5)+2,$AO22))","v":""},{"$f":"IF(OR($AN22=\"\",$AO22=\"\"),\"\",INDEX('Uncertainy tables (Beta)'!$G$7:$J$31,(($AN22-1)*5)+3,$AO22))","v":""},{"$f":"IF(OR($AN22=\"\",$AO22=\"\"),\"\",INDEX('Uncertainy tables (Beta)'!$G$7:$J$31,(($AN22-1)*5)+4,$AO22))","v":""},{"$f":"IF(OR($AN22=\"\",$AO22=\"\"),\"\",INDEX('Uncertainy tables (Beta)'!$G$7:$J$31,(($AN22-1)*5)+5,$AO22))","v":""},null,"","",{"$f":"IF(OR($AV22=\"\",$AW22=\"\"),\"\",INDEX('Uncertainy tables (Beta)'!$G$7:$J$31,(($AV22-1)*5)+1,$AW22))","v":""},{"$f":"IF(OR($AV22=\"\",$AW22=\"\"),\"\",INDEX('Uncertainy tables (Beta)'!$G$7:$J$31,(($AV22-1)*5)+2,$AW22))","v":""},{"$f":"IF(OR($AV22=\"\",$AW22=\"\"),\"\",INDEX('Uncertainy tables (Beta)'!$G$7:$J$31,(($AV22-1)*5)+3,$AW22))","v":""},{"$f":"IF(OR($AV22=\"\",$AW22=\"\"),\"\",INDEX('Uncertainy tables (Beta)'!$G$7:$J$31,(($AV22-1)*5)+4,$AW22))","v":""},{"$f":"IF(OR($AV22=\"\",$AW22=\"\"),\"\",INDEX('Uncertainy tables (Beta)'!$G$7:$J$31,(($AV22-1)*5)+5,$AW22))","v":""}]
["xiii",{"$f":"IF('Part B - Importing'!B64=0,\"\",'Part B - Importing'!B64)","v":"对检验检疫合格的货物，MAWR应签发植物检疫证书，并在附加声明中注明“该批樱桃符合《乌兹别克斯坦樱桃输华植物检疫要求议定书》的规定，不带中方关注的检疫性有害生物”。\nMAWR在开展贸易前向AQSIQ提供植物检疫证书样本，以便确认备案。"},null,null,null,null,null,null,null,null,null,null,{"$f":"IF('Part B - Importing'!C64=0,\"\",'Part B - Importing'!C64)","v":""},null,null,null,null,null,null,null,null,null,null,null,null,null,null,null,null,null,null,null,null,null,null,null,null,null,13,"","",{"$f":"IF(OR($AN23=\"\",$AO23=\"\"),\"\",INDEX('Uncertainy tables (Beta)'!$G$7:$J$31,(($AN23-1)*5)+1,$AO23))","v":""},{"$f":"IF(OR($AN23=\"\",$AO23=\"\"),\"\",INDEX('Uncertainy tables (Beta)'!$G$7:$J$31,(($AN23-1)*5)+2,$AO23))","v":""},{"$f":"IF(OR($AN23=\"\",$AO23=\"\"),\"\",INDEX('Uncertainy tables (Beta)'!$G$7:$J$31,(($AN23-1)*5)+3,$AO23))","v":""},{"$f":"IF(OR($AN23=\"\",$AO23=\"\"),\"\",INDEX('Uncertainy tables (Beta)'!$G$7:$J$31,(($AN23-1)*5)+4,$AO23))","v":""},{"$f":"IF(OR($AN23=\"\",$AO23=\"\"),\"\",INDEX('Uncertainy tables (Beta)'!$G$7:$J$31,(($AN23-1)*5)+5,$AO23))","v":""},null,"","",{"$f":"IF(OR($AV23=\"\",$AW23=\"\"),\"\",INDEX('Uncertainy tables (Beta)'!$G$7:$J$31,(($AV23-1)*5)+1,$AW23))","v":""},{"$f":"IF(OR($AV23=\"\",$AW23=\"\"),\"\",INDEX('Uncertainy tables (Beta)'!$G$7:$J$31,(($AV23-1)*5)+2,$AW23))","v":""},{"$f":"IF(OR($AV23=\"\",$AW23=\"\"),\"\",INDEX('Uncertainy tables (Beta)'!$G$7:$J$31,(($AV23-1)*5)+3,$AW23))","v":""},{"$f":"IF(OR($AV23=\"\",$AW23=\"\"),\"\",INDEX('Uncertainy tables (Beta)'!$G$7:$J$31,(($AV23-1)*5)+4,$AW23))","v":""},{"$f":"IF(OR($AV23=\"\",$AW23=\"\"),\"\",INDEX('Uncertainy tables (Beta)'!$G$7:$J$31,(($AV23-1)*5)+5,$AW23))","v":""}]
["xiv",{"$f":"IF('Part B - Importing'!B65=0,\"\",'Part B - Importing'!B65)","v":"对于实施出口前冷处理的樱桃，应在植物检疫证书上注明检疫处理方式、处理温度、持续时间及处理设施名称或编号等信息。对于实施运输途中冷处理的，应在植物检疫证书上标注“Cold treatment in transit”（途中冷处理），并注明冷处理的温度、处理时间、集装箱号码及封识号码等。"},null,null,null,null,null,null,null,null,null,null,{"$f":"IF('Part B - Importing'!C65=0,\"\",'Part B - Importing'!C65)","v":""},null,null,null,null,null,null,null,null,null,null,null,null,null,null,null,null,null,null,null,null,null,null,null,null,null,14,"","",{"$f":"IF(OR($AN24=\"\",$AO24=\"\"),\"\",INDEX('Uncertainy tables (Beta)'!$G$7:$J$31,(($AN24-1)*5)+1,$AO24))","v":""},{"$f":"IF(OR($AN24=\"\",$AO24=\"\"),\"\",INDEX('Uncertainy tables (Beta)'!$G$7:$J$31,(($AN24-1)*5)+2,$AO24))","v":""},{"$f":"IF(OR($AN24=\"\",$AO24=\"\"),\"\",INDEX('Uncertainy tables (Beta)'!$G$7:$J$31,(($AN24-1)*5)+3,$AO24))","v":""},{"$f":"IF(OR($AN24=\"\",$AO24=\"\"),\"\",INDEX('Uncertainy tables (Beta)'!$G$7:$J$31,(($AN24-1)*5)+4,$AO24))","v":""},{"$f":"IF(OR($AN24=\"\",$AO24=\"\"),\"\",INDEX('Uncertainy tables (Beta)'!$G$7:$J$31,(($AN24-1)*5)+5,$AO24))","v":""},null,"","",{"$f":"IF(OR($AV24=\"\",$AW24=\"\"),\"\",INDEX('Uncertainy tables (Beta)'!$G$7:$J$31,(($AV24-1)*5)+1,$AW24))","v":""},{"$f":"IF(OR($AV24=\"\",$AW24=\"\"),\"\",INDEX('Uncertainy tables (Beta)'!$G$7:$J$31,(($AV24-1)*5)+2,$AW24))","v":""},{"$f":"IF(OR($AV24=\"\",$AW24=\"\"),\"\",INDEX('Uncertainy tables (Beta)'!$G$7:$J$31,(($AV24-1)*5)+3,$AW24))","v":""},{"$f":"IF(OR($AV24=\"\",$AW24=\"\"),\"\",INDEX('Uncertainy tables (Beta)'!$G$7:$J$31,(($AV24-1)*5)+4,$AW24))","v":""},{"$f":"IF(OR($AV24=\"\",$AW24=\"\"),\"\",INDEX('Uncertainy tables (Beta)'!$G$7:$J$31,(($AV24-1)*5)+5,$AW24))","v":""}]
["xv",{"$f":"IF('Part B - Importing'!B66=0,\"\",'Part B - Importing'!B66)","v":"有关单证和标志进行核查，未经注册的果园、包装厂不准进境。如发现中方关注的任何检疫性有害生物，该批货物将作除害处理，退回或销毁处理。"},null,null,null,null,null,null,null,null,null,null,{"$f":"IF('Part B - Importing'!C66=0,\"\",'Part B - Importing'!C66)","v":""},null,null,null,null,null,null,null,null,null,null,null,null,null,null,null,null,null,null,null,null,null,null,null,null,null,15,"","",{"$f":"IF(OR($AN25=\"\",$AO25=\"\"),\"\",INDEX('Uncertainy tables (Beta)'!$G$7:$J$31,(($AN25-1)*5)+1,$AO25))","v":""},{"$f":"IF(OR($AN25=\"\",$AO25=\"\"),\"\",INDEX('Uncertainy tables (Beta)'!$G$7:$J$31,(($AN25-1)*5)+2,$AO25))","v":""},{"$f":"IF(OR($AN25=\"\",$AO25=\"\"),\"\",INDEX('Uncertainy tables (Beta)'!$G$7:$J$31,(($AN25-1)*5)+3,$AO25))","v":""},{"$f":"IF(OR($AN25=\"\",$AO25=\"\"),\"\",INDEX('Uncertainy tables (Beta)'!$G$7:$J$31,(($AN25-1)*5)+4,$AO25))","v":""},{"$f":"IF(OR($AN25=\"\",$AO25=\"\"),\"\",INDEX('Uncertainy tables (Beta)'!$G$7:$J$31,(($AN25-1)*5)+5,$AO25))","v":""},null,"","",{"$f":"IF(OR($AV25=\"\",$AW25=\"\"),\"\",INDEX('Uncertainy tables (Beta)'!$G$7:$J$31,(($AV25-1)*5)+1,$AW25))","v":""},{"$f":"IF(OR($AV25=\"\",$AW25=\"\"),\"\",INDEX('Uncertainy tables (Beta)'!$G$7:$J$31,(($AV25-1)*5)+2,$AW25))","v":""},{"$f":"IF(OR($AV25=\"\",$AW25=\"\"),\"\",INDEX('Uncertainy tables (Beta)'!$G$7:$J$31,(($AV25-1)*5)+3,$AW25))","v":""},{"$f":"IF(OR($AV25=\"\",$AW25=\"\"),\"\",INDEX('Uncertainy tables (Beta)'!$G$7:$J$31,(($AV25-1)*5)+4,$AW25))","v":""},{"$f":"IF(OR($AV25=\"\",$AW25=\"\"),\"\",INDEX('Uncertainy tables (Beta)'!$G$7:$J$31,(($AV25-1)*5)+5,$AW25))","v":""}]
["xvi",{"$f":"IF('Part B - Importing'!B67=0,\"\",'Part B - Importing'!B67)","v":"本项目开始前，在MAWR协助下，AQSIQ将派至少两名植物检疫官员赴乌兹别克斯坦对樱桃有害生物监测体系和输华樱桃相关产区、果园、包装厂的植物卫生要求进行实地考察，并根据考察结果确认输华樱桃的产区、果园、包装厂名单。"},null,null,null,null,null,null,null,null,null,null,{"$f":"IF('Part B - Importing'!C67=0,\"\",'Part B - Importing'!C67)","v":""},null,null,null,null,null,null,null,null,null,null,null,null,null,null,null,null,null,null,null,null,null,null,null,null,null,16,"","",{"$f":"IF(OR($AN26=\"\",$AO26=\"\"),\"\",INDEX('Uncertainy tables (Beta)'!$G$7:$J$31,(($AN26-1)*5)+1,$AO26))","v":""},{"$f":"IF(OR($AN26=\"\",$AO26=\"\"),\"\",INDEX('Uncertainy tables (Beta)'!$G$7:$J$31,(($AN26-1)*5)+2,$AO26))","v":""},{"$f":"IF(OR($AN26=\"\",$AO26=\"\"),\"\",INDEX('Uncertainy tables (Beta)'!$G$7:$J$31,(($AN26-1)*5)+3,$AO26))","v":""},{"$f":"IF(OR($AN26=\"\",$AO26=\"\"),\"\",INDEX('Uncertainy tables (Beta)'!$G$7:$J$31,(($AN26-1)*5)+4,$AO26))","v":""},{"$f":"IF(OR($AN26=\"\",$AO26=\"\"),\"\",INDEX('Uncertainy tables (Beta)'!$G$7:$J$31,(($AN26-1)*5)+5,$AO26))","v":""},null,"","",{"$f":"IF(OR($AV26=\"\",$AW26=\"\"),\"\",INDEX('Uncertainy tables (Beta)'!$G$7:$J$31,(($AV26-1)*5)+1,$AW26))","v":""},{"$f":"IF(OR($AV26=\"\",$AW26=\"\"),\"\",INDEX('Uncertainy tables (Beta)'!$G$7:$J$31,(($AV26-1)*5)+2,$AW26))","v":""},{"$f":"IF(OR($AV26=\"\",$AW26=\"\"),\"\",INDEX('Uncertainy tables (Beta)'!$G$7:$J$31,(($AV26-1)*5)+3,$AW26))","v":""},{"$f":"IF(OR($AV26=\"\",$AW26=\"\"),\"\",INDEX('Uncertainy tables (Beta)'!$G$7:$J$31,(($AV26-1)*5)+4,$AW26))","v":""},{"$f":"IF(OR($AV26=\"\",$AW26=\"\"),\"\",INDEX('Uncertainy tables (Beta)'!$G$7:$J$31,(($AV26-1)*5)+5,$AW26))","v":""}]
["xvii",{"$f":"IF('Part B - Importing'!B68=0,\"\",'Part B - Importing'!B68)","v":"在贸易过程中，AQSIQ将根据乌兹别克斯坦樱桃疫情发生动态及截获情况开展进一步的风险评估，并与MAWR协商，以适时调整检疫性有害生物名单及相应的检疫措施。为确保有关风险管理措施和操作要求的有效落实，AQSIQ和MAWR将按照相应的程序和规章对本议定书执行情况进行审核和评估。"},null,null,null,null,null,null,null,null,null,null,{"$f":"IF('Part B - Importing'!C68=0,\"\",'Part B - Importing'!C68)","v":""},null,null,null,null,null,null,null,null,null,null,null,null,null,null,null,null,null,null,null,null,null,null,null,null,null,17,"","",{"$f":"IF(OR($AN27=\"\",$AO27=\"\"),\"\",INDEX('Uncertainy tables (Beta)'!$G$7:$J$31,(($AN27-1)*5)+1,$AO27))","v":""},{"$f":"IF(OR($AN27=\"\",$AO27=\"\"),\"\",INDEX('Uncertainy tables (Beta)'!$G$7:$J$31,(($AN27-1)*5)+2,$AO27))","v":""},{"$f":"IF(OR($AN27=\"\",$AO27=\"\"),\"\",INDEX('Uncertainy tables (Beta)'!$G$7:$J$31,(($AN27-1)*5)+3,$AO27))","v":""},{"$f":"IF(OR($AN27=\"\",$AO27=\"\"),\"\",INDEX('Uncertainy tables (Beta)'!$G$7:$J$31,(($AN27-1)*5)+4,$AO27))","v":""},{"$f":"IF(OR($AN27=\"\",$AO27=\"\"),\"\",INDEX('Uncertainy tables (Beta)'!$G$7:$J$31,(($AN27-1)*5)+5,$AO27))","v":""},null,"","",{"$f":"IF(OR($AV27=\"\",$AW27=\"\"),\"\",INDEX('Uncertainy tables (Beta)'!$G$7:$J$31,(($AV27-1)*5)+1,$AW27))","v":""},{"$f":"IF(OR($AV27=\"\",$AW27=\"\"),\"\",INDEX('Uncertainy tables (Beta)'!$G$7:$J$31,(($AV27-1)*5)+2,$AW27))","v":""},{"$f":"IF(OR($AV27=\"\",$AW27=\"\"),\"\",INDEX('Uncertainy tables (Beta)'!$G$7:$J$31,(($AV27-1)*5)+3,$AW27))","v":""},{"$f":"IF(OR($AV27=\"\",$AW27=\"\"),\"\",INDEX('Uncertainy tables (Beta)'!$G$7:$J$31,(($AV27-1)*5)+4,$AW27))","v":""},{"$f":"IF(OR($AV27=\"\",$AW27=\"\"),\"\",INDEX('Uncertainy tables (Beta)'!$G$7:$J$31,(($AV27-1)*5)+5,$AW27))","v":""}]
["xviii",{"$f":"IF('Part B - Importing'!B69=0,\"\",'Part B - Importing'!B69)","v":""},null,null,null,null,null,null,null,null,null,null,{"$f":"IF('Part B - Importing'!C69=0,\"\",'Part B - Importing'!C69)","v":""},null,null,null,null,null,null,null,null,null,null,null,null,null,null,null,null,null,null,null,null,null,null,null,null,null,18,"","",{"$f":"IF(OR($AN28=\"\",$AO28=\"\"),\"\",INDEX('Uncertainy tables (Beta)'!$G$7:$J$31,(($AN28-1)*5)+1,$AO28))","v":""},{"$f":"IF(OR($AN28=\"\",$AO28=\"\"),\"\",INDEX('Uncertainy tables (Beta)'!$G$7:$J$31,(($AN28-1)*5)+2,$AO28))","v":""},{"$f":"IF(OR($AN28=\"\",$AO28=\"\"),\"\",INDEX('Uncertainy tables (Beta)'!$G$7:$J$31,(($AN28-1)*5)+3,$AO28))","v":""},{"$f":"IF(OR($AN28=\"\",$AO28=\"\"),\"\",INDEX('Uncertainy tables (Beta)'!$G$7:$J$31,(($AN28-1)*5)+4,$AO28))","v":""},{"$f":"IF(OR($AN28=\"\",$AO28=\"\"),\"\",INDEX('Uncertainy tables (Beta)'!$G$7:$J$31,(($AN28-1)*5)+5,$AO28))","v":""},null,"","",{"$f":"IF(OR($AV28=\"\",$AW28=\"\"),\"\",INDEX('Uncertainy tables (Beta)'!$G$7:$J$31,(($AV28-1)*5)+1,$AW28))","v":""},{"$f":"IF(OR($AV28=\"\",$AW28=\"\"),\"\",INDEX('Uncertainy tables (Beta)'!$G$7:$J$31,(($AV28-1)*5)+2,$AW28))","v":""},{"$f":"IF(OR($AV28=\"\",$AW28=\"\"),\"\",INDEX('Uncertainy tables (Beta)'!$G$7:$J$31,(($AV28-1)*5)+3,$AW28))","v":""},{"$f":"IF(OR($AV28=\"\",$AW28=\"\"),\"\",INDEX('Uncertainy tables (Beta)'!$G$7:$J$31,(($AV28-1)*5)+4,$AW28))","v":""},{"$f":"IF(OR($AV28=\"\",$AW28=\"\"),\"\",INDEX('Uncertainy tables (Beta)'!$G$7:$J$31,(($AV28-1)*5)+5,$AW28))","v":""}]
["xix",{"$f":"IF('Part B - Importing'!B70=0,\"\",'Part B - Importing'!B70)","v":""},null,null,null,null,null,null,null,null,null,null,{"$f":"IF('Part B - Importing'!C70=0,\"\",'Part B - Importing'!C70)","v":""},null,null,null,null,null,null,null,null,null,null,null,null,null,null,null,null,null,null,null,null,null,null,null,null,null,19,"","",{"$f":"IF(OR($AN29=\"\",$AO29=\"\"),\"\",INDEX('Uncertainy tables (Beta)'!$G$7:$J$31,(($AN29-1)*5)+1,$AO29))","v":""},{"$f":"IF(OR($AN29=\"\",$AO29=\"\"),\"\",INDEX('Uncertainy tables (Beta)'!$G$7:$J$31,(($AN29-1)*5)+2,$AO29))","v":""},{"$f":"IF(OR($AN29=\"\",$AO29=\"\"),\"\",INDEX('Uncertainy tables (Beta)'!$G$7:$J$31,(($AN29-1)*5)+3,$AO29))","v":""},{"$f":"IF(OR($AN29=\"\",$AO29=\"\"),\"\",INDEX('Uncertainy tables (Beta)'!$G$7:$J$31,(($AN29-1)*5)+4,$AO29))","v":""},{"$f":"IF(OR($AN29=\"\",$AO29=\"\"),\"\",INDEX('Uncertainy tables (Beta)'!$G$7:$J$31,(($AN29-1)*5)+5,$AO29))","v":""},null,"","",{"$f":"IF(OR($AV29=\"\",$AW29=\"\"),\"\",INDEX('Uncertainy tables (Beta)'!$G$7:$J$31,(($AV29-1)*5)+1,$AW29))","v":""},{"$f":"IF(OR($AV29=\"\",$AW29=\"\"),\"\",INDEX('Uncertainy tables (Beta)'!$G$7:$J$31,(($AV29-1)*5)+2,$AW29))","v":""},{"$f":"IF(OR($AV29=\"\",$AW29=\"\"),\"\",INDEX('Uncertainy tables (Beta)'!$G$7:$J$31,(($AV29-1)*5)+3,$AW29))","v":""},{"$f":"IF(OR($AV29=\"\",$AW29=\"\"),\"\",INDEX('Uncertainy tables (Beta)'!$G$7:$J$31,(($AV29-1)*5)+4,$AW29))","v":""},{"$f":"IF(OR($AV29=\"\",$AW29=\"\"),\"\",INDEX('Uncertainy tables (Beta)'!$G$7:$J$31,(($AV29-1)*5)+5,$AW29))","v":""}]
["xx",{"$f":"IF('Part B - Importing'!B71=0,\"\",'Part B - Importing'!B71)","v":""},null,null,null,null,null,null,null,null,null,null,{"$f":"IF('Part B - Importing'!C71=0,\"\",'Part B - Importing'!C71)","v":""},null,null,null,null,null,null,null,null,null,null,null,null,null,null,null,null,null,null,null,null,null,null,null,null,null,20,"","",{"$f":"IF(OR($AN30=\"\",$AO30=\"\"),\"\",INDEX('Uncertainy tables (Beta)'!$G$7:$J$31,(($AN30-1)*5)+1,$AO30))","v":""},{"$f":"IF(OR($AN30=\"\",$AO30=\"\"),\"\",INDEX('Uncertainy tables (Beta)'!$G$7:$J$31,(($AN30-1)*5)+2,$AO30))","v":""},{"$f":"IF(OR($AN30=\"\",$AO30=\"\"),\"\",INDEX('Uncertainy tables (Beta)'!$G$7:$J$31,(($AN30-1)*5)+3,$AO30))","v":""},{"$f":"IF(OR($AN30=\"\",$AO30=\"\"),\"\",INDEX('Uncertainy tables (Beta)'!$G$7:$J$31,(($AN30-1)*5)+4,$AO30))","v":""},{"$f":"IF(OR($AN30=\"\",$AO30=\"\"),\"\",INDEX('Uncertainy tables (Beta)'!$G$7:$J$31,(($AN30-1)*5)+5,$AO30))","v":""},null,"","",{"$f":"IF(OR($AV30=\"\",$AW30=\"\"),\"\",INDEX('Uncertainy tables (Beta)'!$G$7:$J$31,(($AV30-1)*5)+1,$AW30))","v":""},{"$f":"IF(OR($AV30=\"\",$AW30=\"\"),\"\",INDEX('Uncertainy tables (Beta)'!$G$7:$J$31,(($AV30-1)*5)+2,$AW30))","v":""},{"$f":"IF(OR($AV30=\"\",$AW30=\"\"),\"\",INDEX('Uncertainy tables (Beta)'!$G$7:$J$31,(($AV30-1)*5)+3,$AW30))","v":""},{"$f":"IF(OR($AV30=\"\",$AW30=\"\"),\"\",INDEX('Uncertainy tables (Beta)'!$G$7:$J$31,(($AV30-1)*5)+4,$AW30))","v":""},{"$f":"IF(OR($AV30=\"\",$AW30=\"\"),\"\",INDEX('Uncertainy tables (Beta)'!$G$7:$J$31,(($AV30-1)*5)+5,$AW30))","v":""}]
[]
["表C2.措施指标（验证措施对控制点的影响的能力、生产者可接受度、行业可接受度、社会可接受度）"]
[null,{"$f":"B8","v":"可用的系统方法措施（来自B部分）"},"验证措施对控制点的影响的能力",null,null,"生产者可接受度",null,null,"行业可接受度",null,null,"社会可接受度 ",null,null,null,null,null,null,null,null,null,null,null,null,null,null,null,null,null,null,null,null,null,null,null,null,null,null,null,null,null,{"$f":"C33","v":"验证措施对控制点的影响的能力"},null,null,null,null,null,null,null,{"$f":"F33","v":"生产者可接受度"},null,null,null,null,null,{"$f":"I33","v":"行业可接受度"},null,null,null,null,null,null,null,null,null,{"$f":"I33","v":"行业可接受度"}]
[null,null,"使用控制点调整系统的能力是：",null,null,"生产者可接受度是： ",null,null,"行业可接受度是：",null,null,"社会可接受度是：",null,null,null,null,null,null,null,null,null,null,null,null,null,null,null,null,null,null,null,null,null,null,null,null,null,null,null,null,null,{"$f":"AP35","v":"非常低\t"},{"$f":"AQ35","v":"低"},{"$f":"AR35","v":"中"},{"$f":"AS35","v":"高"},{"$f":"AT35","v":"非常高"},null,null,null,{"$f":"AX35","v":"非常低\t"},{"$f":"AY35","v":"低"},{"$f":"AZ35","v":"中"},{"$f":"BA35","v":"高"},{"$f":"BB35","v":"非常高"},null,null,null,{"$f":"BF35","v":"非常低\t"},{"$f":"BG35","v":"低"},{"$f":"BH35","v":"中"},{"$f":"BI35","v":"高"},{"$f":"BJ35","v":"非常高"},null,null,null,{"$f":"BN35","v":"非常低\t"},{"$f":"BO35","v":"低"},{"$f":"BP35","v":"中"},{"$f":"BQ35","v":"高"},{"$f":"BR35","v":"非常高"}]
[null,null,"评分","不确定性","图表","评分","不确定性","图表","评分","不确定性","图表","评分","不确定性","图表",null,null,null,null,null,null,null,null,null,null,null,null,null,null,null,null,null,null,null,null,null,null,null,null,null,"评分","不确定性",{"$f":"$A$98","v":"非常低\t"},{"$f":"$A$99","v":"低"},{"$f":"$A$100","v":"中"},{"$f":"$A$101","v":"高"},{"$f":"$A$102","v":"非常高"},null,"评分","不确定性",{"$f":"$A$98","v":"非常低\t"},{"$f":"$A$99","v":"低"},{"$f":"$A$100","v":"中"},{"$f":"$A$101","v":"高"},{"$f":"$A$102","v":"非常高"},null,"评分","不确定性",{"$f":"$A$98","v":"非常低\t"},{"$f":"$A$99","v":"低"},{"$f":"$A$100","v":"中"},{"$f":"$A$101","v":"高"},{"$f":"$A$102","v":"非常高"},null,"评分","不确定性",{"$f":"$A$98","v":"非常低\t"},{"$f":"$A$99","v":"低"},{"$f":"$A$100","v":"中"},{"$f":"$A$101","v":"高"},{"$f":"$A$102","v":"非常高"}]
["i",{"$f":"B11","v":"输华樱桃果园、设施审核批准注册"},null,null,null,null,null,null,null,null,null,null,null,null,null,null,null,null,null,null,null,null,null,null,null,null,null,null,null,null,null,null,null,null,null,null,null,null,1,{"$f":"IF(C36=$A$98,1,IF(C36=$A$99,2,IF(C36=$A$100,3,IF(C36=$A$101,4,IF(C36=$A$102,5,\"\")))))","v":""},{"$f":"IF(D36=$B$98,1,IF(D36=$B$99,2,IF(D36=$B$100,3,IF(D36=$B$101,4,\"\"))))","v":""},{"$f":"IF(OR($AN36=\"\",$AO36=\"\"),\"\",INDEX('Uncertainy tables (Beta)'!$G$7:$J$31,(($AN36-1)*5)+1,$AO36))","v":""},{"$f":"IF(OR($AN36=\"\",$AO36=\"\"),\"\",INDEX('Uncertainy tables (Beta)'!$G$7:$J$31,(($AN36-1)*5)+2,$AO36))","v":""},{"$f":"IF(OR($AN36=\"\",$AO36=\"\"),\"\",INDEX('Uncertainy tables (Beta)'!$G$7:$J$31,(($AN36-1)*5)+3,$AO36))","v":""},{"$f":"IF(OR($AN36=\"\",$AO36=\"\"),\"\",INDEX('Uncertainy tables (Beta)'!$G$7:$J$31,(($AN36-1)*5)+4,$AO36))","v":""},{"$f":"IF(OR($AN36=\"\",$AO36=\"\"),\"\",INDEX('Uncertainy tables (Beta)'!$G$7:$J$31,(($AN36-1)*5)+5,$AO36))","v":""},null,{"$f":"IF(F36=$A$98,1,IF(F36=$A$99,2,IF(F36=$A$100,3,IF(F36=$A$101,4,IF(F36=$A$102,5,\"\")))))","v":""},{"$f":"IF(G36=$B$98,1,IF(G36=$B$99,2,IF(G36=$B$100,3,IF(G36=$B$101,4,\"\"))))","v":""},{"$f":"IF(OR($AV36=\"\",$AW36=\"\"),\"\",INDEX('Uncertainy tables (Beta)'!$G$7:$J$31,(($AV36-1)*5)+1,$AW36))","v":""},{"$f":"IF(OR($AV36=\"\",$AW36=\"\"),\"\",INDEX('Uncertainy tables (Beta)'!$G$7:$J$31,(($AV36-1)*5)+2,$AW36))","v":""},{"$f":"IF(OR($AV36=\"\",$AW36=\"\"),\"\",INDEX('Uncertainy tables (Beta)'!$G$7:$J$31,(($AV36-1)*5)+3,$AW36))","v":""},{"$f":"IF(OR($AV36=\"\",$AW36=\"\"),\"\",INDEX('Uncertainy tables (Beta)'!$G$7:$J$31,(($AV36-1)*5)+4,$AW36))","v":""},{"$f":"IF(OR($AV36=\"\",$AW36=\"\"),\"\",INDEX('Uncertainy tables (Beta)'!$G$7:$J$31,(($AV36-1)*5)+5,$AW36))","v":""},null,{"$f":"IF(I36=$A$98,1,IF(I36=$A$99,2,IF(I36=$A$100,3,IF(I36=$A$101,4,IF(I36=$A$102,5,\"\")))))","v":""},{"$f":"IF(J36=$B$98,1,IF(J36=$B$99,2,IF(J36=$B$100,3,IF(J36=$B$101,4,\"\"))))","v":""},{"$f":"IF(OR($BD36=\"\",$BE36=\"\"),\"\",INDEX('Uncertainy tables (Beta)'!$G$7:$J$31,(($BD36-1)*5)+1,$BE36))","v":""},{"$f":"IF(OR($BD36=\"\",$BE36=\"\"),\"\",INDEX('Uncertainy tables (Beta)'!$G$7:$J$31,(($BD36-1)*5)+2,$BE36))","v":""},{"$f":"IF(OR($BD36=\"\",$BE36=\"\"),\"\",INDEX('Uncertainy tables (Beta)'!$G$7:$J$31,(($BD36-1)*5)+3,$BE36))","v":""},{"$f":"IF(OR($BD36=\"\",$BE36=\"\"),\"\",INDEX('Uncertainy tables (Beta)'!$G$7:$J$31,(($BD36-1)*5)+4,$BE36))","v":""},{"$f":"IF(OR($BD36=\"\",$BE36=\"\"),\"\",INDEX('Uncertainy tables (Beta)'!$G$7:$J$31,(($BD36-1)*5)+5,$BE36))","v":""},null,{"$f":"IF(L36=$A$98,1,IF(L36=$A$99,2,IF(L36=$A$100,3,IF(L36=$A$101,4,IF(L36=$A$102,5,\"\")))))","v":""},{"$f":"IF(M36=$B$98,1,IF(M36=$B$99,2,IF(M36=$B$100,3,IF(M36=$B$101,4,\"\"))))","v":""},{"$f":"IF(OR($BL36=\"\",$BM36=\"\"),\"\",INDEX('Uncertainy tables (Beta)'!$G$7:$J$31,(($BL36-1)*5)+1,$BM36))","v":""},{"$f":"IF(OR($BL36=\"\",$BM36=\"\"),\"\",INDEX('Uncertainy tables (Beta)'!$G$7:$J$31,(($BL36-1)*5)+2,$BM36))","v":""},{"$f":"IF(OR($BL36=\"\",$BM36=\"\"),\"\",INDEX('Uncertainy tables (Beta)'!$G$7:$J$31,(($BL36-1)*5)+3,$BM36))","v":""},{"$f":"IF(OR($BL36=\"\",$BM36=\"\"),\"\",INDEX('Uncertainy tables (Beta)'!$G$7:$J$31,(($BL36-1)*5)+4,$BM36))","v":""},{"$f":"IF(OR($BL36=\"\",$BM36=\"\"),\"\",INDEX('Uncertainy tables (Beta)'!$G$7:$J$31,(($BL36-1)*5)+5,$BM36))","v":""}]
["ii",{"$f":"B12","v":"输华樱桃果园内不得种植其他植物。"},null,null,null,null,null,null,null,null,null,null,null,null,null,null,null,null,null,null,null,null,null,null,null,null,null,null,null,null,null,null,null,null,null,null,null,null,{"$f":"AM36+1","v":2},{"$f":"IF(C37=$A$98,1,IF(C37=$A$99,2,IF(C37=$A$100,3,IF(C37=$A$101,4,IF(C37=$A$102,5,\"\")))))","v":""},"",{"$f":"IF(OR($AN37=\"\",$AO37=\"\"),\"\",INDEX('Uncertainy tables (Beta)'!$G$7:$J$31,(($AN37-1)*5)+1,$AO37))","v":""},{"$f":"IF(OR($AN37=\"\",$AO37=\"\"),\"\",INDEX('Uncertainy tables (Beta)'!$G$7:$J$31,(($AN37-1)*5)+2,$AO37))","v":""},{"$f":"IF(OR($AN37=\"\",$AO37=\"\"),\"\",INDEX('Uncertainy tables (Beta)'!$G$7:$J$31,(($AN37-1)*5)+3,$AO37))","v":""},{"$f":"IF(OR($AN37=\"\",$AO37=\"\"),\"\",INDEX('Uncertainy tables (Beta)'!$G$7:$J$31,(($AN37-1)*5)+4,$AO37))","v":""},{"$f":"IF(OR($AN37=\"\",$AO37=\"\"),\"\",INDEX('Uncertainy tables (Beta)'!$G$7:$J$31,(($AN37-1)*5)+5,$AO37))","v":""},null,{"$f":"IF(F37=$A$98,1,IF(F37=$A$99,2,IF(F37=$A$100,3,IF(F37=$A$101,4,IF(F37=$A$102,5,\"\")))))","v":""},"",{"$f":"IF(OR($AV37=\"\",$AW37=\"\"),\"\",INDEX('Uncertainy tables (Beta)'!$G$7:$J$31,(($AV37-1)*5)+1,$AW37))","v":""},{"$f":"IF(OR($AV37=\"\",$AW37=\"\"),\"\",INDEX('Uncertainy tables (Beta)'!$G$7:$J$31,(($AV37-1)*5)+2,$AW37))","v":""},{"$f":"IF(OR($AV37=\"\",$AW37=\"\"),\"\",INDEX('Uncertainy tables (Beta)'!$G$7:$J$31,(($AV37-1)*5)+3,$AW37))","v":""},{"$f":"IF(OR($AV37=\"\",$AW37=\"\"),\"\",INDEX('Uncertainy tables (Beta)'!$G$7:$J$31,(($AV37-1)*5)+4,$AW37))","v":""},{"$f":"IF(OR($AV37=\"\",$AW37=\"\"),\"\",INDEX('Uncertainy tables (Beta)'!$G$7:$J$31,(($AV37-1)*5)+5,$AW37))","v":""},null,{"$f":"IF(I37=$A$98,1,IF(I37=$A$99,2,IF(I37=$A$100,3,IF(I37=$A$101,4,IF(I37=$A$102,5,\"\")))))","v":""},"",{"$f":"IF(OR($BD37=\"\",$BE37=\"\"),\"\",INDEX('Uncertainy tables (Beta)'!$G$7:$J$31,(($BD37-1)*5)+1,$BE37))","v":""},{"$f":"IF(OR($BD37=\"\",$BE37=\"\"),\"\",INDEX('Uncertainy tables (Beta)'!$G$7:$J$31,(($BD37-1)*5)+2,$BE37))","v":""},{"$f":"IF(OR($BD37=\"\",$BE37=\"\"),\"\",INDEX('Uncertainy tables (Beta)'!$G$7:$J$31,(($BD37-1)*5)+3,$BE37))","v":""},{"$f":"IF(OR($BD37=\"\",$BE37=\"\"),\"\",INDEX('Uncertainy tables (Beta)'!$G$7:$J$31,(($BD37-1)*5)+4,$BE37))","v":""},{"$f":"IF(OR($BD37=\"\",$BE37=\"\"),\"\",INDEX('Uncertainy tables (Beta)'!$G$7:$J$31,(($BD37-1)*5)+5,$BE37))","v":""},null,{"$f":"IF(L37=$A$98,1,IF(L37=$A$99,2,IF(L37=$A$100,3,IF(L37=$A$101,4,IF(L37=$A$102,5,\"\")))))","v":""},"",{"$f":"IF(OR($BL37=\"\",$BM37=\"\"),\"\",INDEX('Uncertainy tables (Beta)'!$G$7:$J$31,(($BL37-1)*5)+1,$BM37))","v":""},{"$f":"IF(OR($BL37=\"\",$BM37=\"\"),\"\",INDEX('Uncertainy tables (Beta)'!$G$7:$J$31,(($BL37-1)*5)+2,$BM37))","v":""},{"$f":"IF(OR($BL37=\"\",$BM37=\"\"),\"\",INDEX('Uncertainy tables (Beta)'!$G$7:$J$31,(($BL37-1)*5)+3,$BM37))","v":""},{"$f":"IF(OR($BL37=\"\",$BM37=\"\"),\"\",INDEX('Uncertainy tables (Beta)'!$G$7:$J$31,(($BL37-1)*5)+4,$BM37))","v":""},{"$f":"IF(OR($BL37=\"\",$BM37=\"\"),\"\",INDEX('Uncertainy tables (Beta)'!$G$7:$J$31,(($BL37-1)*5)+5,$BM37))","v":""}]
["iii","输华樱桃必须来自苹果蠹蛾的非疫生产点（PFPSs）并采取有效的预防控制措施，非疫生产点的建立应遵循ISPM10的原则。",null,null,null,null,null,null,null,null,null,null,null,null,null,null,null,null,null,null,null,null,null,null,null,null,null,null,null,null,null,null,null,null,null,null,null,null,{"$f":"AM37+1","v":3},"","",{"$f":"IF(OR($AN38=\"\",$AO38=\"\"),\"\",INDEX('Uncertainy tables (Beta)'!$G$7:$J$31,(($AN38-1)*5)+1,$AO38))","v":""},{"$f":"IF(OR($AN38=\"\",$AO38=\"\"),\"\",INDEX('Uncertainy tables (Beta)'!$G$7:$J$31,(($AN38-1)*5)+2,$AO38))","v":""},{"$f":"IF(OR($AN38=\"\",$AO38=\"\"),\"\",INDEX('Uncertainy tables (Beta)'!$G$7:$J$31,(($AN38-1)*5)+3,$AO38))","v":""},{"$f":"IF(OR($AN38=\"\",$AO38=\"\"),\"\",INDEX('Uncertainy tables (Beta)'!$G$7:$J$31,(($AN38-1)*5)+4,$AO38))","v":""},{"$f":"IF(OR($AN38=\"\",$AO38=\"\"),\"\",INDEX('Uncertainy tables (Beta)'!$G$7:$J$31,(($AN38-1)*5)+5,$AO38))","v":""},null,"","",{"$f":"IF(OR($AV38=\"\",$AW38=\"\"),\"\",INDEX('Uncertainy tables (Beta)'!$G$7:$J$31,(($AV38-1)*5)+1,$AW38))","v":""},{"$f":"IF(OR($AV38=\"\",$AW38=\"\"),\"\",INDEX('Uncertainy tables (Beta)'!$G$7:$J$31,(($AV38-1)*5)+2,$AW38))","v":""},{"$f":"IF(OR($AV38=\"\",$AW38=\"\"),\"\",INDEX('Uncertainy tables (Beta)'!$G$7:$J$31,(($AV38-1)*5)+3,$AW38))","v":""},{"$f":"IF(OR($AV38=\"\",$AW38=\"\"),\"\",INDEX('Uncertainy tables (Beta)'!$G$7:$J$31,(($AV38-1)*5)+4,$AW38))","v":""},{"$f":"IF(OR($AV38=\"\",$AW38=\"\"),\"\",INDEX('Uncertainy tables (Beta)'!$G$7:$J$31,(($AV38-1)*5)+5,$AW38))","v":""},null,"","",{"$f":"IF(OR($BD38=\"\",$BE38=\"\"),\"\",INDEX('Uncertainy tables (Beta)'!$G$7:$J$31,(($BD38-1)*5)+1,$BE38))","v":""},{"$f":"IF(OR($BD38=\"\",$BE38=\"\"),\"\",INDEX('Uncertainy tables (Beta)'!$G$7:$J$31,(($BD38-1)*5)+2,$BE38))","v":""},{"$f":"IF(OR($BD38=\"\",$BE38=\"\"),\"\",INDEX('Uncertainy tables (Beta)'!$G$7:$J$31,(($BD38-1)*5)+3,$BE38))","v":""},{"$f":"IF(OR($BD38=\"\",$BE38=\"\"),\"\",INDEX('Uncertainy tables (Beta)'!$G$7:$J$31,(($BD38-1)*5)+4,$BE38))","v":""},{"$f":"IF(OR($BD38=\"\",$BE38=\"\"),\"\",INDEX('Uncertainy tables (Beta)'!$G$7:$J$31,(($BD38-1)*5)+5,$BE38))","v":""},null,"","",{"$f":"IF(OR($BL38=\"\",$BM38=\"\"),\"\",INDEX('Uncertainy tables (Beta)'!$G$7:$J$31,(($BL38-1)*5)+1,$BM38))","v":""},{"$f":"IF(OR($BL38=\"\",$BM38=\"\"),\"\",INDEX('Uncertainy tables (Beta)'!$G$7:$J$31,(($BL38-1)*5)+2,$BM38))","v":""},{"$f":"IF(OR($BL38=\"\",$BM38=\"\"),\"\",INDEX('Uncertainy tables (Beta)'!$G$7:$J$31,(($BL38-1)*5)+3,$BM38))","v":""},{"$f":"IF(OR($BL38=\"\",$BM38=\"\"),\"\",INDEX('Uncertainy tables (Beta)'!$G$7:$J$31,(($BL38-1)*5)+4,$BM38))","v":""},{"$f":"IF(OR($BL38=\"\",$BM38=\"\"),\"\",INDEX('Uncertainy tables (Beta)'!$G$7:$J$31,(($BL38-1)*5)+5,$BM38))","v":""}]
["iv","培训技术人员",null,null,null,null,null,null,null,null,null,null,null,null,null,null,null,null,null,null,null,null,null,null,null,null,null,null,null,null,null,null,null,null,null,null,null,null,4,"","",{"$f":"IF(OR($AN39=\"\",$AO39=\"\"),\"\",INDEX('Uncertainy tables (Beta)'!$G$7:$J$31,(($AN39-1)*5)+1,$AO39))","v":""},{"$f":"IF(OR($AN39=\"\",$AO39=\"\"),\"\",INDEX('Uncertainy tables (Beta)'!$G$7:$J$31,(($AN39-1)*5)+2,$AO39))","v":""},{"$f":"IF(OR($AN39=\"\",$AO39=\"\"),\"\",INDEX('Uncertainy tables (Beta)'!$G$7:$J$31,(($AN39-1)*5)+3,$AO39))","v":""},{"$f":"IF(OR($AN39=\"\",$AO39=\"\"),\"\",INDEX('Uncertainy tables (Beta)'!$G$7:$J$31,(($AN39-1)*5)+4,$AO39))","v":""},{"$f":"IF(OR($AN39=\"\",$AO39=\"\"),\"\",INDEX('Uncertainy tables (Beta)'!$G$7:$J$31,(($AN39-1)*5)+5,$AO39))","v":""},null,"","",{"$f":"IF(OR($AV39=\"\",$AW39=\"\"),\"\",INDEX('Uncertainy tables (Beta)'!$G$7:$J$31,(($AV39-1)*5)+1,$AW39))","v":""},{"$f":"IF(OR($AV39=\"\",$AW39=\"\"),\"\",INDEX('Uncertainy tables (Beta)'!$G$7:$J$31,(($AV39-1)*5)+2,$AW39))","v":""},{"$f":"IF(OR($AV39=\"\",$AW39=\"\"),\"\",INDEX('Uncertainy tables (Beta)'!$G$7:$J$31,(($AV39-1)*5)+3,$AW39))","v":""},{"$f":"IF(OR($AV39=\"\",$AW39=\"\"),\"\",INDEX('Uncertainy tables (Beta)'!$G$7:$J$31,(($AV39-1)*5)+4,$AW39))","v":""},{"$f":"IF(OR($AV39=\"\",$AW39=\"\"),\"\",INDEX('Uncertainy tables (Beta)'!$G$7:$J$31,(($AV39-1)*5)+5,$AW39))","v":""},null,"","",{"$f":"IF(OR($BD39=\"\",$BE39=\"\"),\"\",INDEX('Uncertainy tables (Beta)'!$G$7:$J$31,(($BD39-1)*5)+1,$BE39))","v":""},{"$f":"IF(OR($BD39=\"\",$BE39=\"\"),\"\",INDEX('Uncertainy tables (Beta)'!$G$7:$J$31,(($BD39-1)*5)+2,$BE39))","v":""},{"$f":"IF(OR($BD39=\"\",$BE39=\"\"),\"\",INDEX('Uncertainy tables (Beta)'!$G$7:$J$31,(($BD39-1)*5)+3,$BE39))","v":""},{"$f":"IF(OR($BD39=\"\",$BE39=\"\"),\"\",INDEX('Uncertainy tables (Beta)'!$G$7:$J$31,(($BD39-1)*5)+4,$BE39))","v":""},{"$f":"IF(OR($BD39=\"\",$BE39=\"\"),\"\",INDEX('Uncertainy tables (Beta)'!$G$7:$J$31,(($BD39-1)*5)+5,$BE39))","v":""},null,"","",{"$f":"IF(OR($BL39=\"\",$BM39=\"\"),\"\",INDEX('Uncertainy tables (Beta)'!$G$7:$J$31,(($BL39-1)*5)+1,$BM39))","v":""},{"$f":"IF(OR($BL39=\"\",$BM39=\"\"),\"\",INDEX('Uncertainy tables (Beta)'!$G$7:$J$31,(($BL39-1)*5)+2,$BM39))","v":""},{"$f":"IF(OR($BL39=\"\",$BM39=\"\"),\"\",INDEX('Uncertainy tables (Beta)'!$G$7:$J$31,(($BL39-1)*5)+3,$BM39))","v":""},{"$f":"IF(OR($BL39=\"\",$BM39=\"\"),\"\",INDEX('Uncertainy tables (Beta)'!$G$7:$J$31,(($BL39-1)*5)+4,$BM39))","v":""},{"$f":"IF(OR($BL39=\"\",$BM39=\"\"),\"\",INDEX('Uncertainy tables (Beta)'!$G$7:$J$31,(($BL39-1)*5)+5,$BM39))","v":""}]
["v","施良好农业规范（GAP）、执行有害生物综合防治（IPM）",null,null,null,null,null,null,null,null,null,null,null,null,null,null,null,null,null,null,null,null,null,null,null,null,null,null,null,null,null,null,null,null,null,null,null,null,5,"","",{"$f":"IF(OR($AN40=\"\",$AO40=\"\"),\"\",INDEX('Uncertainy tables (Beta)'!$G$7:$J$31,(($AN40-1)*5)+1,$AO40))","v":""},{"$f":"IF(OR($AN40=\"\",$AO40=\"\"),\"\",INDEX('Uncertainy tables (Beta)'!$G$7:$J$31,(($AN40-1)*5)+2,$AO40))","v":""},{"$f":"IF(OR($AN40=\"\",$AO40=\"\"),\"\",INDEX('Uncertainy tables (Beta)'!$G$7:$J$31,(($AN40-1)*5)+3,$AO40))","v":""},{"$f":"IF(OR($AN40=\"\",$AO40=\"\"),\"\",INDEX('Uncertainy tables (Beta)'!$G$7:$J$31,(($AN40-1)*5)+4,$AO40))","v":""},{"$f":"IF(OR($AN40=\"\",$AO40=\"\"),\"\",INDEX('Uncertainy tables (Beta)'!$G$7:$J$31,(($AN40-1)*5)+5,$AO40))","v":""},null,"","",{"$f":"IF(OR($AV40=\"\",$AW40=\"\"),\"\",INDEX('Uncertainy tables (Beta)'!$G$7:$J$31,(($AV40-1)*5)+1,$AW40))","v":""},{"$f":"IF(OR($AV40=\"\",$AW40=\"\"),\"\",INDEX('Uncertainy tables (Beta)'!$G$7:$J$31,(($AV40-1)*5)+2,$AW40))","v":""},{"$f":"IF(OR($AV40=\"\",$AW40=\"\"),\"\",INDEX('Uncertainy tables (Beta)'!$G$7:$J$31,(($AV40-1)*5)+3,$AW40))","v":""},{"$f":"IF(OR($AV40=\"\",$AW40=\"\"),\"\",INDEX('Uncertainy tables (Beta)'!$G$7:$J$31,(($AV40-1)*5)+4,$AW40))","v":""},{"$f":"IF(OR($AV40=\"\",$AW40=\"\"),\"\",INDEX('Uncertainy tables (Beta)'!$G$7:$J$31,(($AV40-1)*5)+5,$AW40))","v":""},null,"","",{"$f":"IF(OR($BD40=\"\",$BE40=\"\"),\"\",INDEX('Uncertainy tables (Beta)'!$G$7:$J$31,(($BD40-1)*5)+1,$BE40))","v":""},{"$f":"IF(OR($BD40=\"\",$BE40=\"\"),\"\",INDEX('Uncertainy tables (Beta)'!$G$7:$J$31,(($BD40-1)*5)+2,$BE40))","v":""},{"$f":"IF(OR($BD40=\"\",$BE40=\"\"),\"\",INDEX('Uncertainy tables (Beta)'!$G$7:$J$31,(($BD40-1)*5)+3,$BE40))","v":""},{"$f":"IF(OR($BD40=\"\",$BE40=\"\"),\"\",INDEX('Uncertainy tables (Beta)'!$G$7:$J$31,(($BD40-1)*5)+4,$BE40))","v":""},{"$f":"IF(OR($BD40=\"\",$BE40=\"\"),\"\",INDEX('Uncertainy tables (Beta)'!$G$7:$J$31,(($BD40-1)*5)+5,$BE40))","v":""},null,"","",{"$f":"IF(OR($BL40=\"\",$BM40=\"\"),\"\",INDEX('Uncertainy tables (Beta)'!$G$7:$J$31,(($BL40-1)*5)+1,$BM40))","v":""},{"$f":"IF(OR($BL40=\"\",$BM40=\"\"),\"\",INDEX('Uncertainy tables (Beta)'!$G$7:$J$31,(($BL40-1)*5)+2,$BM40))","v":""},{"$f":"IF(OR($BL40=\"\",$BM40=\"\"),\"\",INDEX('Uncertainy tables (Beta)'!$G$7:$J$31,(($BL40-1)*5)+3,$BM40))","v":""},{"$f":"IF(OR($BL40=\"\",$BM40=\"\"),\"\",INDEX('Uncertainy tables (Beta)'!$G$7:$J$31,(($BL40-1)*5)+4,$BM40))","v":""},{"$f":"IF(OR($BL40=\"\",$BM40=\"\"),\"\",INDEX('Uncertainy tables (Beta)'!$G$7:$J$31,(($BL40-1)*5)+5,$BM40))","v":""}]
["vi","果园监控：对苹果蠹蛾的监测调查从盛花期开始，一直到樱桃的包装工作结束。",null,null,null,null,null,null,null,null,null,null,null,null,null,null,null,null,null,null,null,null,null,null,null,null,null,null,null,null,null,null,null,null,null,null,null,null,6,"","",{"$f":"IF(OR($AN41=\"\",$AO41=\"\"),\"\",INDEX('Uncertainy tables (Beta)'!$G$7:$J$31,(($AN41-1)*5)+1,$AO41))","v":""},{"$f":"IF(OR($AN41=\"\",$AO41=\"\"),\"\",INDEX('Uncertainy tables (Beta)'!$G$7:$J$31,(($AN41-1)*5)+2,$AO41))","v":""},{"$f":"IF(OR($AN41=\"\",$AO41=\"\"),\"\",INDEX('Uncertainy tables (Beta)'!$G$7:$J$31,(($AN41-1)*5)+3,$AO41))","v":""},{"$f":"IF(OR($AN41=\"\",$AO41=\"\"),\"\",INDEX('Uncertainy tables (Beta)'!$G$7:$J$31,(($AN41-1)*5)+4,$AO41))","v":""},{"$f":"IF(OR($AN41=\"\",$AO41=\"\"),\"\",INDEX('Uncertainy tables (Beta)'!$G$7:$J$31,(($AN41-1)*5)+5,$AO41))","v":""},null,"","",{"$f":"IF(OR($AV41=\"\",$AW41=\"\"),\"\",INDEX('Uncertainy tables (Beta)'!$G$7:$J$31,(($AV41-1)*5)+1,$AW41))","v":""},{"$f":"IF(OR($AV41=\"\",$AW41=\"\"),\"\",INDEX('Uncertainy tables (Beta)'!$G$7:$J$31,(($AV41-1)*5)+2,$AW41))","v":""},{"$f":"IF(OR($AV41=\"\",$AW41=\"\"),\"\",INDEX('Uncertainy tables (Beta)'!$G$7:$J$31,(($AV41-1)*5)+3,$AW41))","v":""},{"$f":"IF(OR($AV41=\"\",$AW41=\"\"),\"\",INDEX('Uncertainy tables (Beta)'!$G$7:$J$31,(($AV41-1)*5)+4,$AW41))","v":""},{"$f":"IF(OR($AV41=\"\",$AW41=\"\"),\"\",INDEX('Uncertainy tables (Beta)'!$G$7:$J$31,(($AV41-1)*5)+5,$AW41))","v":""},null,"","",{"$f":"IF(OR($BD41=\"\",$BE41=\"\"),\"\",INDEX('Uncertainy tables (Beta)'!$G$7:$J$31,(($BD41-1)*5)+1,$BE41))","v":""},{"$f":"IF(OR($BD41=\"\",$BE41=\"\"),\"\",INDEX('Uncertainy tables (Beta)'!$G$7:$J$31,(($BD41-1)*5)+2,$BE41))","v":""},{"$f":"IF(OR($BD41=\"\",$BE41=\"\"),\"\",INDEX('Uncertainy tables (Beta)'!$G$7:$J$31,(($BD41-1)*5)+3,$BE41))","v":""},{"$f":"IF(OR($BD41=\"\",$BE41=\"\"),\"\",INDEX('Uncertainy tables (Beta)'!$G$7:$J$31,(($BD41-1)*5)+4,$BE41))","v":""},{"$f":"IF(OR($BD41=\"\",$BE41=\"\"),\"\",INDEX('Uncertainy tables (Beta)'!$G$7:$J$31,(($BD41-1)*5)+5,$BE41))","v":""},null,"","",{"$f":"IF(OR($BL41=\"\",$BM41=\"\"),\"\",INDEX('Uncertainy tables (Beta)'!$G$7:$J$31,(($BL41-1)*5)+1,$BM41))","v":""},{"$f":"IF(OR($BL41=\"\",$BM41=\"\"),\"\",INDEX('Uncertainy tables (Beta)'!$G$7:$J$31,(($BL41-1)*5)+2,$BM41))","v":""},{"$f":"IF(OR($BL41=\"\",$BM41=\"\"),\"\",INDEX('Uncertainy tables (Beta)'!$G$7:$J$31,(($BL41-1)*5)+3,$BM41))","v":""},{"$f":"IF(OR($BL41=\"\",$BM41=\"\"),\"\",INDEX('Uncertainy tables (Beta)'!$G$7:$J$31,(($BL41-1)*5)+4,$BM41))","v":""},{"$f":"IF(OR($BL41=\"\",$BM41=\"\"),\"\",INDEX('Uncertainy tables (Beta)'!$G$7:$J$31,(($BL41-1)*5)+5,$BM41))","v":""}]
["vii","果园监控：对苹果蠹蛾的监测调查从盛花期开始，一直到樱桃的包装工作结束。",null,null,null,null,null,null,null,null,null,null,null,null,null,null,null,null,null,null,null,null,null,null,null,null,null,null,null,null,null,null,null,null,null,null,null,null,7,"","",{"$f":"IF(OR($AN42=\"\",$AO42=\"\"),\"\",INDEX('Uncertainy tables (Beta)'!$G$7:$J$31,(($AN42-1)*5)+1,$AO42))","v":""},{"$f":"IF(OR($AN42=\"\",$AO42=\"\"),\"\",INDEX('Uncertainy tables (Beta)'!$G$7:$J$31,(($AN42-1)*5)+2,$AO42))","v":""},{"$f":"IF(OR($AN42=\"\",$AO42=\"\"),\"\",INDEX('Uncertainy tables (Beta)'!$G$7:$J$31,(($AN42-1)*5)+3,$AO42))","v":""},{"$f":"IF(OR($AN42=\"\",$AO42=\"\"),\"\",INDEX('Uncertainy tables (Beta)'!$G$7:$J$31,(($AN42-1)*5)+4,$AO42))","v":""},{"$f":"IF(OR($AN42=\"\",$AO42=\"\"),\"\",INDEX('Uncertainy tables (Beta)'!$G$7:$J$31,(($AN42-1)*5)+5,$AO42))","v":""},null,"","",{"$f":"IF(OR($AV42=\"\",$AW42=\"\"),\"\",INDEX('Uncertainy tables (Beta)'!$G$7:$J$31,(($AV42-1)*5)+1,$AW42))","v":""},{"$f":"IF(OR($AV42=\"\",$AW42=\"\"),\"\",INDEX('Uncertainy tables (Beta)'!$G$7:$J$31,(($AV42-1)*5)+2,$AW42))","v":""},{"$f":"IF(OR($AV42=\"\",$AW42=\"\"),\"\",INDEX('Uncertainy tables (Beta)'!$G$7:$J$31,(($AV42-1)*5)+3,$AW42))","v":""},{"$f":"IF(OR($AV42=\"\",$AW42=\"\"),\"\",INDEX('Uncertainy tables (Beta)'!$G$7:$J$31,(($AV42-1)*5)+4,$AW42))","v":""},{"$f":"IF(OR($AV42=\"\",$AW42=\"\"),\"\",INDEX('Uncertainy tables (Beta)'!$G$7:$J$31,(($AV42-1)*5)+5,$AW42))","v":""},null,"","",{"$f":"IF(OR($BD42=\"\",$BE42=\"\"),\"\",INDEX('Uncertainy tables (Beta)'!$G$7:$J$31,(($BD42-1)*5)+1,$BE42))","v":""},{"$f":"IF(OR($BD42=\"\",$BE42=\"\"),\"\",INDEX('Uncertainy tables (Beta)'!$G$7:$J$31,(($BD42-1)*5)+2,$BE42))","v":""},{"$f":"IF(OR($BD42=\"\",$BE42=\"\"),\"\",INDEX('Uncertainy tables (Beta)'!$G$7:$J$31,(($BD42-1)*5)+3,$BE42))","v":""},{"$f":"IF(OR($BD42=\"\",$BE42=\"\"),\"\",INDEX('Uncertainy tables (Beta)'!$G$7:$J$31,(($BD42-1)*5)+4,$BE42))","v":""},{"$f":"IF(OR($BD42=\"\",$BE42=\"\"),\"\",INDEX('Uncertainy tables (Beta)'!$G$7:$J$31,(($BD42-1)*5)+5,$BE42))","v":""},null,"","",{"$f":"IF(OR($BL42=\"\",$BM42=\"\"),\"\",INDEX('Uncertainy tables (Beta)'!$G$7:$J$31,(($BL42-1)*5)+1,$BM42))","v":""},{"$f":"IF(OR($BL42=\"\",$BM42=\"\"),\"\",INDEX('Uncertainy tables (Beta)'!$G$7:$J$31,(($BL42-1)*5)+2,$BM42))","v":""},{"$f":"IF(OR($BL42=\"\",$BM42=\"\"),\"\",INDEX('Uncertainy tables (Beta)'!$G$7:$J$31,(($BL42-1)*5)+3,$BM42))","v":""},{"$f":"IF(OR($BL42=\"\",$BM42=\"\"),\"\",INDEX('Uncertainy tables (Beta)'!$G$7:$J$31,(($BL42-1)*5)+4,$BM42))","v":""},{"$f":"IF(OR($BL42=\"\",$BM42=\"\"),\"\",INDEX('Uncertainy tables (Beta)'!$G$7:$J$31,(($BL42-1)*5)+5,$BM42))","v":""}]
["viii","输华樱桃加工、包装、储藏和装运过程，须在乌方或乌方授权人员检疫监管下进行。",null,null,null,null,null,null,null,null,null,null,null,null,null,null,null,null,null,null,null,null,null,null,null,null,null,null,null,null,null,null,null,null,null,null,null,null,8,"","",{"$f":"IF(OR($AN43=\"\",$AO43=\"\"),\"\",INDEX('Uncertainy tables (Beta)'!$G$7:$J$31,(($AN43-1)*5)+1,$AO43))","v":""},{"$f":"IF(OR($AN43=\"\",$AO43=\"\"),\"\",INDEX('Uncertainy tables (Beta)'!$G$7:$J$31,(($AN43-1)*5)+2,$AO43))","v":""},{"$f":"IF(OR($AN43=\"\",$AO43=\"\"),\"\",INDEX('Uncertainy tables (Beta)'!$G$7:$J$31,(($AN43-1)*5)+3,$AO43))","v":""},{"$f":"IF(OR($AN43=\"\",$AO43=\"\"),\"\",INDEX('Uncertainy tables (Beta)'!$G$7:$J$31,(($AN43-1)*5)+4,$AO43))","v":""},{"$f":"IF(OR($AN43=\"\",$AO43=\"\"),\"\",INDEX('Uncertainy tables (Beta)'!$G$7:$J$31,(($AN43-1)*5)+5,$AO43))","v":""},null,"","",{"$f":"IF(OR($AV43=\"\",$AW43=\"\"),\"\",INDEX('Uncertainy tables (Beta)'!$G$7:$J$31,(($AV43-1)*5)+1,$AW43))","v":""},{"$f":"IF(OR($AV43=\"\",$AW43=\"\"),\"\",INDEX('Uncertainy tables (Beta)'!$G$7:$J$31,(($AV43-1)*5)+2,$AW43))","v":""},{"$f":"IF(OR($AV43=\"\",$AW43=\"\"),\"\",INDEX('Uncertainy tables (Beta)'!$G$7:$J$31,(($AV43-1)*5)+3,$AW43))","v":""},{"$f":"IF(OR($AV43=\"\",$AW43=\"\"),\"\",INDEX('Uncertainy tables (Beta)'!$G$7:$J$31,(($AV43-1)*5)+4,$AW43))","v":""},{"$f":"IF(OR($AV43=\"\",$AW43=\"\"),\"\",INDEX('Uncertainy tables (Beta)'!$G$7:$J$31,(($AV43-1)*5)+5,$AW43))","v":""},null,"","",{"$f":"IF(OR($BD43=\"\",$BE43=\"\"),\"\",INDEX('Uncertainy tables (Beta)'!$G$7:$J$31,(($BD43-1)*5)+1,$BE43))","v":""},{"$f":"IF(OR($BD43=\"\",$BE43=\"\"),\"\",INDEX('Uncertainy tables (Beta)'!$G$7:$J$31,(($BD43-1)*5)+2,$BE43))","v":""},{"$f":"IF(OR($BD43=\"\",$BE43=\"\"),\"\",INDEX('Uncertainy tables (Beta)'!$G$7:$J$31,(($BD43-1)*5)+3,$BE43))","v":""},{"$f":"IF(OR($BD43=\"\",$BE43=\"\"),\"\",INDEX('Uncertainy tables (Beta)'!$G$7:$J$31,(($BD43-1)*5)+4,$BE43))","v":""},{"$f":"IF(OR($BD43=\"\",$BE43=\"\"),\"\",INDEX('Uncertainy tables (Beta)'!$G$7:$J$31,(($BD43-1)*5)+5,$BE43))","v":""},null,"","",{"$f":"IF(OR($BL43=\"\",$BM43=\"\"),\"\",INDEX('Uncertainy tables (Beta)'!$G$7:$J$31,(($BL43-1)*5)+1,$BM43))","v":""},{"$f":"IF(OR($BL43=\"\",$BM43=\"\"),\"\",INDEX('Uncertainy tables (Beta)'!$G$7:$J$31,(($BL43-1)*5)+2,$BM43))","v":""},{"$f":"IF(OR($BL43=\"\",$BM43=\"\"),\"\",INDEX('Uncertainy tables (Beta)'!$G$7:$J$31,(($BL43-1)*5)+3,$BM43))","v":""},{"$f":"IF(OR($BL43=\"\",$BM43=\"\"),\"\",INDEX('Uncertainy tables (Beta)'!$G$7:$J$31,(($BL43-1)*5)+4,$BM43))","v":""},{"$f":"IF(OR($BL43=\"\",$BM43=\"\"),\"\",INDEX('Uncertainy tables (Beta)'!$G$7:$J$31,(($BL43-1)*5)+5,$BM43))","v":""}]
["ix","在加工、包装过程中，须对樱桃进行挑选、分拣和处理，以保证输华的樱桃不带有昆虫、螨类、烂果及枝、叶、根和土壤。",null,null,null,null,null,null,null,null,null,null,null,null,null,null,null,null,null,null,null,null,null,null,null,null,null,null,null,null,null,null,null,null,null,null,null,null,9,"","",{"$f":"IF(OR($AN44=\"\",$AO44=\"\"),\"\",INDEX('Uncertainy tables (Beta)'!$G$7:$J$31,(($AN44-1)*5)+1,$AO44))","v":""},{"$f":"IF(OR($AN44=\"\",$AO44=\"\"),\"\",INDEX('Uncertainy tables (Beta)'!$G$7:$J$31,(($AN44-1)*5)+2,$AO44))","v":""},{"$f":"IF(OR($AN44=\"\",$AO44=\"\"),\"\",INDEX('Uncertainy tables (Beta)'!$G$7:$J$31,(($AN44-1)*5)+3,$AO44))","v":""},{"$f":"IF(OR($AN44=\"\",$AO44=\"\"),\"\",INDEX('Uncertainy tables (Beta)'!$G$7:$J$31,(($AN44-1)*5)+4,$AO44))","v":""},{"$f":"IF(OR($AN44=\"\",$AO44=\"\"),\"\",INDEX('Uncertainy tables (Beta)'!$G$7:$J$31,(($AN44-1)*5)+5,$AO44))","v":""},null,"","",{"$f":"IF(OR($AV44=\"\",$AW44=\"\"),\"\",INDEX('Uncertainy tables (Beta)'!$G$7:$J$31,(($AV44-1)*5)+1,$AW44))","v":""},{"$f":"IF(OR($AV44=\"\",$AW44=\"\"),\"\",INDEX('Uncertainy tables (Beta)'!$G$7:$J$31,(($AV44-1)*5)+2,$AW44))","v":""},{"$f":"IF(OR($AV44=\"\",$AW44=\"\"),\"\",INDEX('Uncertainy tables (Beta)'!$G$7:$J$31,(($AV44-1)*5)+3,$AW44))","v":""},{"$f":"IF(OR($AV44=\"\",$AW44=\"\"),\"\",INDEX('Uncertainy tables (Beta)'!$G$7:$J$31,(($AV44-1)*5)+4,$AW44))","v":""},{"$f":"IF(OR($AV44=\"\",$AW44=\"\"),\"\",INDEX('Uncertainy tables (Beta)'!$G$7:$J$31,(($AV44-1)*5)+5,$AW44))","v":""},null,"","",{"$f":"IF(OR($BD44=\"\",$BE44=\"\"),\"\",INDEX('Uncertainy tables (Beta)'!$G$7:$J$31,(($BD44-1)*5)+1,$BE44))","v":""},{"$f":"IF(OR($BD44=\"\",$BE44=\"\"),\"\",INDEX('Uncertainy tables (Beta)'!$G$7:$J$31,(($BD44-1)*5)+2,$BE44))","v":""},{"$f":"IF(OR($BD44=\"\",$BE44=\"\"),\"\",INDEX('Uncertainy tables (Beta)'!$G$7:$J$31,(($BD44-1)*5)+3,$BE44))","v":""},{"$f":"IF(OR($BD44=\"\",$BE44=\"\"),\"\",INDEX('Uncertainy tables (Beta)'!$G$7:$J$31,(($BD44-1)*5)+4,$BE44))","v":""},{"$f":"IF(OR($BD44=\"\",$BE44=\"\"),\"\",INDEX('Uncertainy tables (Beta)'!$G$7:$J$31,(($BD44-1)*5)+5,$BE44))","v":""},null,"","",{"$f":"IF(OR($BL44=\"\",$BM44=\"\"),\"\",INDEX('Uncertainy tables (Beta)'!$G$7:$J$31,(($BL44-1)*5)+1,$BM44))","v":""},{"$f":"IF(OR($BL44=\"\",$BM44=\"\"),\"\",INDEX('Uncertainy tables (Beta)'!$G$7:$J$31,(($BL44-1)*5)+2,$BM44))","v":""},{"$f":"IF(OR($BL44=\"\",$BM44=\"\"),\"\",INDEX('Uncertainy tables (Beta)'!$G$7:$J$31,(($BL44-1)*5)+3,$BM44))","v":""},{"$f":"IF(OR($BL44=\"\",$BM44=\"\"),\"\",INDEX('Uncertainy tables (Beta)'!$G$7:$J$31,(($BL44-1)*5)+4,$BM44))","v":""},{"$f":"IF(OR($BL44=\"\",$BM44=\"\"),\"\",INDEX('Uncertainy tables (Beta)'!$G$7:$J$31,(($BL44-1)*5)+5,$BM44))","v":""}]
["x","对输华樱桃要使用专门的包装线，不得同时包装其他水果，避免被有害生物污染。",null,null,null,null,null,null,null,null,null,null,null,null,null,null,null,null,null,null,null,null,null,null,null,null,null,null,null,null,null,null,null,null,null,null,null,null,10,"","",{"$f":"IF(OR($AN45=\"\",$AO45=\"\"),\"\",INDEX('Uncertainy tables (Beta)'!$G$7:$J$31,(($AN45-1)*5)+1,$AO45))","v":""},{"$f":"IF(OR($AN45=\"\",$AO45=\"\"),\"\",INDEX('Uncertainy tables (Beta)'!$G$7:$J$31,(($AN45-1)*5)+2,$AO45))","v":""},{"$f":"IF(OR($AN45=\"\",$AO45=\"\"),\"\",INDEX('Uncertainy tables (Beta)'!$G$7:$J$31,(($AN45-1)*5)+3,$AO45))","v":""},{"$f":"IF(OR($AN45=\"\",$AO45=\"\"),\"\",INDEX('Uncertainy tables (Beta)'!$G$7:$J$31,(($AN45-1)*5)+4,$AO45))","v":""},{"$f":"IF(OR($AN45=\"\",$AO45=\"\"),\"\",INDEX('Uncertainy tables (Beta)'!$G$7:$J$31,(($AN45-1)*5)+5,$AO45))","v":""},null,"","",{"$f":"IF(OR($AV45=\"\",$AW45=\"\"),\"\",INDEX('Uncertainy tables (Beta)'!$G$7:$J$31,(($AV45-1)*5)+1,$AW45))","v":""},{"$f":"IF(OR($AV45=\"\",$AW45=\"\"),\"\",INDEX('Uncertainy tables (Beta)'!$G$7:$J$31,(($AV45-1)*5)+2,$AW45))","v":""},{"$f":"IF(OR($AV45=\"\",$AW45=\"\"),\"\",INDEX('Uncertainy tables (Beta)'!$G$7:$J$31,(($AV45-1)*5)+3,$AW45))","v":""},{"$f":"IF(OR($AV45=\"\",$AW45=\"\"),\"\",INDEX('Uncertainy tables (Beta)'!$G$7:$J$31,(($AV45-1)*5)+4,$AW45))","v":""},{"$f":"IF(OR($AV45=\"\",$AW45=\"\"),\"\",INDEX('Uncertainy tables (Beta)'!$G$7:$J$31,(($AV45-1)*5)+5,$AW45))","v":""},null,"","",{"$f":"IF(OR($BD45=\"\",$BE45=\"\"),\"\",INDEX('Uncertainy tables (Beta)'!$G$7:$J$31,(($BD45-1)*5)+1,$BE45))","v":""},{"$f":"IF(OR($BD45=\"\",$BE45=\"\"),\"\",INDEX('Uncertainy tables (Beta)'!$G$7:$J$31,(($BD45-1)*5)+2,$BE45))","v":""},{"$f":"IF(OR($BD45=\"\",$BE45=\"\"),\"\",INDEX('Uncertainy tables (Beta)'!$G$7:$J$31,(($BD45-1)*5)+3,$BE45))","v":""},{"$f":"IF(OR($BD45=\"\",$BE45=\"\"),\"\",INDEX('Uncertainy tables (Beta)'!$G$7:$J$31,(($BD45-1)*5)+4,$BE45))","v":""},{"$f":"IF(OR($BD45=\"\",$BE45=\"\"),\"\",INDEX('Uncertainy tables (Beta)'!$G$7:$J$31,(($BD45-1)*5)+5,$BE45))","v":""},null,"","",{"$f":"IF(OR($BL45=\"\",$BM45=\"\"),\"\",INDEX('Uncertainy tables (Beta)'!$G$7:$J$31,(($BL45-1)*5)+1,$BM45))","v":""},{"$f":"IF(OR($BL45=\"\",$BM45=\"\"),\"\",INDEX('Uncertainy tables (Beta)'!$G$7:$J$31,(($BL45-1)*5)+2,$BM45))","v":""},{"$f":"IF(OR($BL45=\"\",$BM45=\"\"),\"\",INDEX('Uncertainy tables (Beta)'!$G$7:$J$31,(($BL45-1)*5)+3,$BM45))","v":""},{"$f":"IF(OR($BL45=\"\",$BM45=\"\"),\"\",INDEX('Uncertainy tables (Beta)'!$G$7:$J$31,(($BL45-1)*5)+4,$BM45))","v":""},{"$f":"IF(OR($BL45=\"\",$BM45=\"\"),\"\",INDEX('Uncertainy tables (Beta)'!$G$7:$J$31,(($BL45-1)*5)+5,$BM45))","v":""}]
["xi","包装好的樱桃应单独储藏，避免受有害生物再感染。樱桃包装箱上应用英文标出水果名称、产地（地区和万户（Tuman））、果园和包装厂及其注册号。每个出口托盘包装上应有经MAWR确认的检疫标识。每个包装箱和托盘需用中文标出“输往中华人民共和国”。\n樱桃包装材料应干净卫生、未使用过，符合中国有关植物检疫要求。",null,null,null,null,null,null,null,null,null,null,null,null,null,null,null,null,null,null,null,null,null,null,null,null,null,null,null,null,null,null,null,null,null,null,null,null,11,"","",{"$f":"IF(OR($AN46=\"\",$AO46=\"\"),\"\",INDEX('Uncertainy tables (Beta)'!$G$7:$J$31,(($AN46-1)*5)+1,$AO46))","v":""},{"$f":"IF(OR($AN46=\"\",$AO46=\"\"),\"\",INDEX('Uncertainy tables (Beta)'!$G$7:$J$31,(($AN46-1)*5)+2,$AO46))","v":""},{"$f":"IF(OR($AN46=\"\",$AO46=\"\"),\"\",INDEX('Uncertainy tables (Beta)'!$G$7:$J$31,(($AN46-1)*5)+3,$AO46))","v":""},{"$f":"IF(OR($AN46=\"\",$AO46=\"\"),\"\",INDEX('Uncertainy tables (Beta)'!$G$7:$J$31,(($AN46-1)*5)+4,$AO46))","v":""},{"$f":"IF(OR($AN46=\"\",$AO46=\"\"),\"\",INDEX('Uncertainy tables (Beta)'!$G$7:$J$31,(($AN46-1)*5)+5,$AO46))","v":""},null,"","",{"$f":"IF(OR($AV46=\"\",$AW46=\"\"),\"\",INDEX('Uncertainy tables (Beta)'!$G$7:$J$31,(($AV46-1)*5)+1,$AW46))","v":""},{"$f":"IF(OR($AV46=\"\",$AW46=\"\"),\"\",INDEX('Uncertainy tables (Beta)'!$G$7:$J$31,(($AV46-1)*5)+2,$AW46))","v":""},{"$f":"IF(OR($AV46=\"\",$AW46=\"\"),\"\",INDEX('Uncertainy tables (Beta)'!$G$7:$J$31,(($AV46-1)*5)+3,$AW46))","v":""},{"$f":"IF(OR($AV46=\"\",$AW46=\"\"),\"\",INDEX('Uncertainy tables (Beta)'!$G$7:$J$31,(($AV46-1)*5)+4,$AW46))","v":""},{"$f":"IF(OR($AV46=\"\",$AW46=\"\"),\"\",INDEX('Uncertainy tables (Beta)'!$G$7:$J$31,(($AV46-1)*5)+5,$AW46))","v":""},null,"","",{"$f":"IF(OR($BD46=\"\",$BE46=\"\"),\"\",INDEX('Uncertainy tables (Beta)'!$G$7:$J$31,(($BD46-1)*5)+1,$BE46))","v":""},{"$f":"IF(OR($BD46=\"\",$BE46=\"\"),\"\",INDEX('Uncertainy tables (Beta)'!$G$7:$J$31,(($BD46-1)*5)+2,$BE46))","v":""},{"$f":"IF(OR($BD46=\"\",$BE46=\"\"),\"\",INDEX('Uncertainy tables (Beta)'!$G$7:$J$31,(($BD46-1)*5)+3,$BE46))","v":""},{"$f":"IF(OR($BD46=\"\",$BE46=\"\"),\"\",INDEX('Uncertainy tables (Beta)'!$G$7:$J$31,(($BD46-1)*5)+4,$BE46))","v":""},{"$f":"IF(OR($BD46=\"\",$BE46=\"\"),\"\",INDEX('Uncertainy tables (Beta)'!$G$7:$J$31,(($BD46-1)*5)+5,$BE46))","v":""},null,"","",{"$f":"IF(OR($BL46=\"\",$BM46=\"\"),\"\",INDEX('Uncertainy tables (Beta)'!$G$7:$J$31,(($BL46-1)*5)+1,$BM46))","v":""},{"$f":"IF(OR($BL46=\"\",$BM46=\"\"),\"\",INDEX('Uncertainy tables (Beta)'!$G$7:$J$31,(($BL46-1)*5)+2,$BM46))","v":""},{"$f":"IF(OR($BL46=\"\",$BM46=\"\"),\"\",INDEX('Uncertainy tables (Beta)'!$G$7:$J$31,(($BL46-1)*5)+3,$BM46))","v":""},{"$f":"IF(OR($BL46=\"\",$BM46=\"\"),\"\",INDEX('Uncertainy tables (Beta)'!$G$7:$J$31,(($BL46-1)*5)+4,$BM46))","v":""},{"$f":"IF(OR($BL46=\"\",$BM46=\"\"),\"\",INDEX('Uncertainy tables (Beta)'!$G$7:$J$31,(($BL46-1)*5)+5,$BM46))","v":""}]
["xii","议定书实施的前两年，MAWR人员需按2%的抽样比例对输华樱桃实施出口检验检疫，最小取样量不得少于1200果，并对其中可疑果进行剖果检查。如果未发现检疫问题，此后抽样比例降低到1%，最小取样量不得少于600果。如果在出口检验检疫中，检出欧洲樱桃实蝇、葡萄花翅小卷蛾和苹果蠹蛾，MAWR将在本出口季节暂停该万户（Tuman）向中国出口，并通报AQSIQ。",null,null,null,null,null,null,null,null,null,null,null,null,null,null,null,null,null,null,null,null,null,null,null,null,null,null,null,null,null,null,null,null,null,null,null,null,12,"","",{"$f":"IF(OR($AN47=\"\",$AO47=\"\"),\"\",INDEX('Uncertainy tables (Beta)'!$G$7:$J$31,(($AN47-1)*5)+1,$AO47))","v":""},{"$f":"IF(OR($AN47=\"\",$AO47=\"\"),\"\",INDEX('Uncertainy tables (Beta)'!$G$7:$J$31,(($AN47-1)*5)+2,$AO47))","v":""},{"$f":"IF(OR($AN47=\"\",$AO47=\"\"),\"\",INDEX('Uncertainy tables (Beta)'!$G$7:$J$31,(($AN47-1)*5)+3,$AO47))","v":""},{"$f":"IF(OR($AN47=\"\",$AO47=\"\"),\"\",INDEX('Uncertainy tables (Beta)'!$G$7:$J$31,(($AN47-1)*5)+4,$AO47))","v":""},{"$f":"IF(OR($AN47=\"\",$AO47=\"\"),\"\",INDEX('Uncertainy tables (Beta)'!$G$7:$J$31,(($AN47-1)*5)+5,$AO47))","v":""},null,"","",{"$f":"IF(OR($AV47=\"\",$AW47=\"\"),\"\",INDEX('Uncertainy tables (Beta)'!$G$7:$J$31,(($AV47-1)*5)+1,$AW47))","v":""},{"$f":"IF(OR($AV47=\"\",$AW47=\"\"),\"\",INDEX('Uncertainy tables (Beta)'!$G$7:$J$31,(($AV47-1)*5)+2,$AW47))","v":""},{"$f":"IF(OR($AV47=\"\",$AW47=\"\"),\"\",INDEX('Uncertainy tables (Beta)'!$G$7:$J$31,(($AV47-1)*5)+3,$AW47))","v":""},{"$f":"IF(OR($AV47=\"\",$AW47=\"\"),\"\",INDEX('Uncertainy tables (Beta)'!$G$7:$J$31,(($AV47-1)*5)+4,$AW47))","v":""},{"$f":"IF(OR($AV47=\"\",$AW47=\"\"),\"\",INDEX('Uncertainy tables (Beta)'!$G$7:$J$31,(($AV47-1)*5)+5,$AW47))","v":""},null,"","",{"$f":"IF(OR($BD47=\"\",$BE47=\"\"),\"\",INDEX('Uncertainy tables (Beta)'!$G$7:$J$31,(($BD47-1)*5)+1,$BE47))","v":""},{"$f":"IF(OR($BD47=\"\",$BE47=\"\"),\"\",INDEX('Uncertainy tables (Beta)'!$G$7:$J$31,(($BD47-1)*5)+2,$BE47))","v":""},{"$f":"IF(OR($BD47=\"\",$BE47=\"\"),\"\",INDEX('Uncertainy tables (Beta)'!$G$7:$J$31,(($BD47-1)*5)+3,$BE47))","v":""},{"$f":"IF(OR($BD47=\"\",$BE47=\"\"),\"\",INDEX('Uncertainy tables (Beta)'!$G$7:$J$31,(($BD47-1)*5)+4,$BE47))","v":""},{"$f":"IF(OR($BD47=\"\",$BE47=\"\"),\"\",INDEX('Uncertainy tables (Beta)'!$G$7:$J$31,(($BD47-1)*5)+5,$BE47))","v":""},null,"","",{"$f":"IF(OR($BL47=\"\",$BM47=\"\"),\"\",INDEX('Uncertainy tables (Beta)'!$G$7:$J$31,(($BL47-1)*5)+1,$BM47))","v":""},{"$f":"IF(OR($BL47=\"\",$BM47=\"\"),\"\",INDEX('Uncertainy tables (Beta)'!$G$7:$J$31,(($BL47-1)*5)+2,$BM47))","v":""},{"$f":"IF(OR($BL47=\"\",$BM47=\"\"),\"\",INDEX('Uncertainy tables (Beta)'!$G$7:$J$31,(($BL47-1)*5)+3,$BM47))","v":""},{"$f":"IF(OR($BL47=\"\",$BM47=\"\"),\"\",INDEX('Uncertainy tables (Beta)'!$G$7:$J$31,(($BL47-1)*5)+4,$BM47))","v":""},{"$f":"IF(OR($BL47=\"\",$BM47=\"\"),\"\",INDEX('Uncertainy tables (Beta)'!$G$7:$J$31,(($BL47-1)*5)+5,$BM47))","v":""}]
["xiii","对检验检疫合格的货物，MAWR应签发植物检疫证书，并在附加声明中注明“该批樱桃符合《乌兹别克斯坦樱桃输华植物检疫要求议定书》的规定，不带中方关注的检疫性有害生物”。\nMAWR在开展贸易前向AQSIQ提供植物检疫证书样本，以便确认备案。",null,null,null,null,null,null,null,null,null,null,null,null,null,null,null,null,null,null,null,null,null,null,null,null,null,null,null,null,null,null,null,null,null,null,null,null,13,"","",{"$f":"IF(OR($AN48=\"\",$AO48=\"\"),\"\",INDEX('Uncertainy tables (Beta)'!$G$7:$J$31,(($AN48-1)*5)+1,$AO48))","v":""},{"$f":"IF(OR($AN48=\"\",$AO48=\"\"),\"\",INDEX('Uncertainy tables (Beta)'!$G$7:$J$31,(($AN48-1)*5)+2,$AO48))","v":""},{"$f":"IF(OR($AN48=\"\",$AO48=\"\"),\"\",INDEX('Uncertainy tables (Beta)'!$G$7:$J$31,(($AN48-1)*5)+3,$AO48))","v":""},{"$f":"IF(OR($AN48=\"\",$AO48=\"\"),\"\",INDEX('Uncertainy tables (Beta)'!$G$7:$J$31,(($AN48-1)*5)+4,$AO48))","v":""},{"$f":"IF(OR($AN48=\"\",$AO48=\"\"),\"\",INDEX('Uncertainy tables (Beta)'!$G$7:$J$31,(($AN48-1)*5)+5,$AO48))","v":""},null,"","",{"$f":"IF(OR($AV48=\"\",$AW48=\"\"),\"\",INDEX('Uncertainy tables (Beta)'!$G$7:$J$31,(($AV48-1)*5)+1,$AW48))","v":""},{"$f":"IF(OR($AV48=\"\",$AW48=\"\"),\"\",INDEX('Uncertainy tables (Beta)'!$G$7:$J$31,(($AV48-1)*5)+2,$AW48))","v":""},{"$f":"IF(OR($AV48=\"\",$AW48=\"\"),\"\",INDEX('Uncertainy tables (Beta)'!$G$7:$J$31,(($AV48-1)*5)+3,$AW48))","v":""},{"$f":"IF(OR($AV48=\"\",$AW48=\"\"),\"\",INDEX('Uncertainy tables (Beta)'!$G$7:$J$31,(($AV48-1)*5)+4,$AW48))","v":""},{"$f":"IF(OR($AV48=\"\",$AW48=\"\"),\"\",INDEX('Uncertainy tables (Beta)'!$G$7:$J$31,(($AV48-1)*5)+5,$AW48))","v":""},null,"","",{"$f":"IF(OR($BD48=\"\",$BE48=\"\"),\"\",INDEX('Uncertainy tables (Beta)'!$G$7:$J$31,(($BD48-1)*5)+1,$BE48))","v":""},{"$f":"IF(OR($BD48=\"\",$BE48=\"\"),\"\",INDEX('Uncertainy tables (Beta)'!$G$7:$J$31,(($BD48-1)*5)+2,$BE48))","v":""},{"$f":"IF(OR($BD48=\"\",$BE48=\"\"),\"\",INDEX('Uncertainy tables (Beta)'!$G$7:$J$31,(($BD48-1)*5)+3,$BE48))","v":""},{"$f":"IF(OR($BD48=\"\",$BE48=\"\"),\"\",INDEX('Uncertainy tables (Beta)'!$G$7:$J$31,(($BD48-1)*5)+4,$BE48))","v":""},{"$f":"IF(OR($BD48=\"\",$BE48=\"\"),\"\",INDEX('Uncertainy tables (Beta)'!$G$7:$J$31,(($BD48-1)*5)+5,$BE48))","v":""},null,"","",{"$f":"IF(OR($BL48=\"\",$BM48=\"\"),\"\",INDEX('Uncertainy tables (Beta)'!$G$7:$J$31,(($BL48-1)*5)+1,$BM48))","v":""},{"$f":"IF(OR($BL48=\"\",$BM48=\"\"),\"\",INDEX('Uncertainy tables (Beta)'!$G$7:$J$31,(($BL48-1)*5)+2,$BM48))","v":""},{"$f":"IF(OR($BL48=\"\",$BM48=\"\"),\"\",INDEX('Uncertainy tables (Beta)'!$G$7:$J$31,(($BL48-1)*5)+3,$BM48))","v":""},{"$f":"IF(OR($BL48=\"\",$BM48=\"\"),\"\",INDEX('Uncertainy tables (Beta)'!$G$7:$J$31,(($BL48-1)*5)+4,$BM48))","v":""},{"$f":"IF(OR($BL48=\"\",$BM48=\"\"),\"\",INDEX('Uncertainy tables (Beta)'!$G$7:$J$31,(($BL48-1)*5)+5,$BM48))","v":""}]
["xiv","对于实施出口前冷处理的樱桃，应在植物检疫证书上注明检疫处理方式、处理温度、持续时间及处理设施名称或编号等信息。对于实施运输途中冷处理的，应在植物检疫证书上标注“Cold treatment in transit”（途中冷处理），并注明冷处理的温度、处理时间、集装箱号码及封识号码等。",null,null,null,null,null,null,null,null,null,null,null,null,null,null,null,null,null,null,null,null,null,null,null,null,null,null,null,null,null,null,null,null,null,null,null,null,14,"","",{"$f":"IF(OR($AN49=\"\",$AO49=\"\"),\"\",INDEX('Uncertainy tables (Beta)'!$G$7:$J$31,(($AN49-1)*5)+1,$AO49))","v":""},{"$f":"IF(OR($AN49=\"\",$AO49=\"\"),\"\",INDEX('Uncertainy tables (Beta)'!$G$7:$J$31,(($AN49-1)*5)+2,$AO49))","v":""},{"$f":"IF(OR($AN49=\"\",$AO49=\"\"),\"\",INDEX('Uncertainy tables (Beta)'!$G$7:$J$31,(($AN49-1)*5)+3,$AO49))","v":""},{"$f":"IF(OR($AN49=\"\",$AO49=\"\"),\"\",INDEX('Uncertainy tables (Beta)'!$G$7:$J$31,(($AN49-1)*5)+4,$AO49))","v":""},{"$f":"IF(OR($AN49=\"\",$AO49=\"\"),\"\",INDEX('Uncertainy tables (Beta)'!$G$7:$J$31,(($AN49-1)*5)+5,$AO49))","v":""},null,"","",{"$f":"IF(OR($AV49=\"\",$AW49=\"\"),\"\",INDEX('Uncertainy tables (Beta)'!$G$7:$J$31,(($AV49-1)*5)+1,$AW49))","v":""},{"$f":"IF(OR($AV49=\"\",$AW49=\"\"),\"\",INDEX('Uncertainy tables (Beta)'!$G$7:$J$31,(($AV49-1)*5)+2,$AW49))","v":""},{"$f":"IF(OR($AV49=\"\",$AW49=\"\"),\"\",INDEX('Uncertainy tables (Beta)'!$G$7:$J$31,(($AV49-1)*5)+3,$AW49))","v":""},{"$f":"IF(OR($AV49=\"\",$AW49=\"\"),\"\",INDEX('Uncertainy tables (Beta)'!$G$7:$J$31,(($AV49-1)*5)+4,$AW49))","v":""},{"$f":"IF(OR($AV49=\"\",$AW49=\"\"),\"\",INDEX('Uncertainy tables (Beta)'!$G$7:$J$31,(($AV49-1)*5)+5,$AW49))","v":""},null,"","",{"$f":"IF(OR($BD49=\"\",$BE49=\"\"),\"\",INDEX('Uncertainy tables (Beta)'!$G$7:$J$31,(($BD49-1)*5)+1,$BE49))","v":""},{"$f":"IF(OR($BD49=\"\",$BE49=\"\"),\"\",INDEX('Uncertainy tables (Beta)'!$G$7:$J$31,(($BD49-1)*5)+2,$BE49))","v":""},{"$f":"IF(OR($BD49=\"\",$BE49=\"\"),\"\",INDEX('Uncertainy tables (Beta)'!$G$7:$J$31,(($BD49-1)*5)+3,$BE49))","v":""},{"$f":"IF(OR($BD49=\"\",$BE49=\"\"),\"\",INDEX('Uncertainy tables (Beta)'!$G$7:$J$31,(($BD49-1)*5)+4,$BE49))","v":""},{"$f":"IF(OR($BD49=\"\",$BE49=\"\"),\"\",INDEX('Uncertainy tables (Beta)'!$G$7:$J$31,(($BD49-1)*5)+5,$BE49))","v":""},null,"","",{"$f":"IF(OR($BL49=\"\",$BM49=\"\"),\"\",INDEX('Uncertainy tables (Beta)'!$G$7:$J$31,(($BL49-1)*5)+1,$BM49))","v":""},{"$f":"IF(OR($BL49=\"\",$BM49=\"\"),\"\",INDEX('Uncertainy tables (Beta)'!$G$7:$J$31,(($BL49-1)*5)+2,$BM49))","v":""},{"$f":"IF(OR($BL49=\"\",$BM49=\"\"),\"\",INDEX('Uncertainy tables (Beta)'!$G$7:$J$31,(($BL49-1)*5)+3,$BM49))","v":""},{"$f":"IF(OR($BL49=\"\",$BM49=\"\"),\"\",INDEX('Uncertainy tables (Beta)'!$G$7:$J$31,(($BL49-1)*5)+4,$BM49))","v":""},{"$f":"IF(OR($BL49=\"\",$BM49=\"\"),\"\",INDEX('Uncertainy tables (Beta)'!$G$7:$J$31,(($BL49-1)*5)+5,$BM49))","v":""}]
["xv","有关单证和标志进行核查，未经注册的果园、包装厂不准进境。如发现中方关注的任何检疫性有害生物，该批货物将作除害处理，退回或销毁处理。",null,null,null,null,null,null,null,null,null,null,null,null,null,null,null,null,null,null,null,null,null,null,null,null,null,null,null,null,null,null,null,null,null,null,null,null,15,"","",{"$f":"IF(OR($AN50=\"\",$AO50=\"\"),\"\",INDEX('Uncertainy tables (Beta)'!$G$7:$J$31,(($AN50-1)*5)+1,$AO50))","v":""},{"$f":"IF(OR($AN50=\"\",$AO50=\"\"),\"\",INDEX('Uncertainy tables (Beta)'!$G$7:$J$31,(($AN50-1)*5)+2,$AO50))","v":""},{"$f":"IF(OR($AN50=\"\",$AO50=\"\"),\"\",INDEX('Uncertainy tables (Beta)'!$G$7:$J$31,(($AN50-1)*5)+3,$AO50))","v":""},{"$f":"IF(OR($AN50=\"\",$AO50=\"\"),\"\",INDEX('Uncertainy tables (Beta)'!$G$7:$J$31,(($AN50-1)*5)+4,$AO50))","v":""},{"$f":"IF(OR($AN50=\"\",$AO50=\"\"),\"\",INDEX('Uncertainy tables (Beta)'!$G$7:$J$31,(($AN50-1)*5)+5,$AO50))","v":""},null,"","",{"$f":"IF(OR($AV50=\"\",$AW50=\"\"),\"\",INDEX('Uncertainy tables (Beta)'!$G$7:$J$31,(($AV50-1)*5)+1,$AW50))","v":""},{"$f":"IF(OR($AV50=\"\",$AW50=\"\"),\"\",INDEX('Uncertainy tables (Beta)'!$G$7:$J$31,(($AV50-1)*5)+2,$AW50))","v":""},{"$f":"IF(OR($AV50=\"\",$AW50=\"\"),\"\",INDEX('Uncertainy tables (Beta)'!$G$7:$J$31,(($AV50-1)*5)+3,$AW50))","v":""},{"$f":"IF(OR($AV50=\"\",$AW50=\"\"),\"\",INDEX('Uncertainy tables (Beta)'!$G$7:$J$31,(($AV50-1)*5)+4,$AW50))","v":""},{"$f":"IF(OR($AV50=\"\",$AW50=\"\"),\"\",INDEX('Uncertainy tables (Beta)'!$G$7:$J$31,(($AV50-1)*5)+5,$AW50))","v":""},null,"","",{"$f":"IF(OR($BD50=\"\",$BE50=\"\"),\"\",INDEX('Uncertainy tables (Beta)'!$G$7:$J$31,(($BD50-1)*5)+1,$BE50))","v":""},{"$f":"IF(OR($BD50=\"\",$BE50=\"\"),\"\",INDEX('Uncertainy tables (Beta)'!$G$7:$J$31,(($BD50-1)*5)+2,$BE50))","v":""},{"$f":"IF(OR($BD50=\"\",$BE50=\"\"),\"\",INDEX('Uncertainy tables (Beta)'!$G$7:$J$31,(($BD50-1)*5)+3,$BE50))","v":""},{"$f":"IF(OR($BD50=\"\",$BE50=\"\"),\"\",INDEX('Uncertainy tables (Beta)'!$G$7:$J$31,(($BD50-1)*5)+4,$BE50))","v":""},{"$f":"IF(OR($BD50=\"\",$BE50=\"\"),\"\",INDEX('Uncertainy tables (Beta)'!$G$7:$J$31,(($BD50-1)*5)+5,$BE50))","v":""},null,"","",{"$f":"IF(OR($BL50=\"\",$BM50=\"\"),\"\",INDEX('Uncertainy tables (Beta)'!$G$7:$J$31,(($BL50-1)*5)+1,$BM50))","v":""},{"$f":"IF(OR($BL50=\"\",$BM50=\"\"),\"\",INDEX('Uncertainy tables (Beta)'!$G$7:$J$31,(($BL50-1)*5)+2,$BM50))","v":""},{"$f":"IF(OR($BL50=\"\",$BM50=\"\"),\"\",INDEX('Uncertainy tables (Beta)'!$G$7:$J$31,(($BL50-1)*5)+3,$BM50))","v":""},{"$f":"IF(OR($BL50=\"\",$BM50=\"\"),\"\",INDEX('Uncertainy tables (Beta)'!$G$7:$J$31,(($BL50-1)*5)+4,$BM50))","v":""},{"$f":"IF(OR($BL50=\"\",$BM50=\"\"),\"\",INDEX('Uncertainy tables (Beta)'!$G$7:$J$31,(($BL50-1)*5)+5,$BM50))","v":""}]
["xvi","本项目开始前，在MAWR协助下，AQSIQ将派至少两名植物检疫官员赴乌兹别克斯坦对樱桃有害生物监测体系和输华樱桃相关产区、果园、包装厂的植物卫生要求进行实地考察，并根据考察结果确认输华樱桃的产区、果园、包装厂名单。",null,null,null,null,null,null,null,null,null,null,null,null,null,null,null,null,null,null,null,null,null,null,null,null,null,null,null,null,null,null,null,null,null,null,null,null,16,"","",{"$f":"IF(OR($AN51=\"\",$AO51=\"\"),\"\",INDEX('Uncertainy tables (Beta)'!$G$7:$J$31,(($AN51-1)*5)+1,$AO51))","v":""},{"$f":"IF(OR($AN51=\"\",$AO51=\"\"),\"\",INDEX('Uncertainy tables (Beta)'!$G$7:$J$31,(($AN51-1)*5)+2,$AO51))","v":""},{"$f":"IF(OR($AN51=\"\",$AO51=\"\"),\"\",INDEX('Uncertainy tables (Beta)'!$G$7:$J$31,(($AN51-1)*5)+3,$AO51))","v":""},{"$f":"IF(OR($AN51=\"\",$AO51=\"\"),\"\",INDEX('Uncertainy tables (Beta)'!$G$7:$J$31,(($AN51-1)*5)+4,$AO51))","v":""},{"$f":"IF(OR($AN51=\"\",$AO51=\"\"),\"\",INDEX('Uncertainy tables (Beta)'!$G$7:$J$31,(($AN51-1)*5)+5,$AO51))","v":""},null,"","",{"$f":"IF(OR($AV51=\"\",$AW51=\"\"),\"\",INDEX('Uncertainy tables (Beta)'!$G$7:$J$31,(($AV51-1)*5)+1,$AW51))","v":""},{"$f":"IF(OR($AV51=\"\",$AW51=\"\"),\"\",INDEX('Uncertainy tables (Beta)'!$G$7:$J$31,(($AV51-1)*5)+2,$AW51))","v":""},{"$f":"IF(OR($AV51=\"\",$AW51=\"\"),\"\",INDEX('Uncertainy tables (Beta)'!$G$7:$J$31,(($AV51-1)*5)+3,$AW51))","v":""},{"$f":"IF(OR($AV51=\"\",$AW51=\"\"),\"\",INDEX('Uncertainy tables (Beta)'!$G$7:$J$31,(($AV51-1)*5)+4,$AW51))","v":""},{"$f":"IF(OR($AV51=\"\",$AW51=\"\"),\"\",INDEX('Uncertainy tables (Beta)'!$G$7:$J$31,(($AV51-1)*5)+5,$AW51))","v":""},null,"","",{"$f":"IF(OR($BD51=\"\",$BE51=\"\"),\"\",INDEX('Uncertainy tables (Beta)'!$G$7:$J$31,(($BD51-1)*5)+1,$BE51))","v":""},{"$f":"IF(OR($BD51=\"\",$BE51=\"\"),\"\",INDEX('Uncertainy tables (Beta)'!$G$7:$J$31,(($BD51-1)*5)+2,$BE51))","v":""},{"$f":"IF(OR($BD51=\"\",$BE51=\"\"),\"\",INDEX('Uncertainy tables (Beta)'!$G$7:$J$31,(($BD51-1)*5)+3,$BE51))","v":""},{"$f":"IF(OR($BD51=\"\",$BE51=\"\"),\"\",INDEX('Uncertainy tables (Beta)'!$G$7:$J$31,(($BD51-1)*5)+4,$BE51))","v":""},{"$f":"IF(OR($BD51=\"\",$BE51=\"\"),\"\",INDEX('Uncertainy tables (Beta)'!$G$7:$J$31,(($BD51-1)*5)+5,$BE51))","v":""},null,"","",{"$f":"IF(OR($BL51=\"\",$BM51=\"\"),\"\",INDEX('Uncertainy tables (Beta)'!$G$7:$J$31,(($BL51-1)*5)+1,$BM51))","v":""},{"$f":"IF(OR($BL51=\"\",$BM51=\"\"),\"\",INDEX('Uncertainy tables (Beta)'!$G$7:$J$31,(($BL51-1)*5)+2,$BM51))","v":""},{"$f":"IF(OR($BL51=\"\",$BM51=\"\"),\"\",INDEX('Uncertainy tables (Beta)'!$G$7:$J$31,(($BL51-1)*5)+3,$BM51))","v":""},{"$f":"IF(OR($BL51=\"\",$BM51=\"\"),\"\",INDEX('Uncertainy tables (Beta)'!$G$7:$J$31,(($BL51-1)*5)+4,$BM51))","v":""},{"$f":"IF(OR($BL51=\"\",$BM51=\"\"),\"\",INDEX('Uncertainy tables (Beta)'!$G$7:$J$31,(($BL51-1)*5)+5,$BM51))","v":""}]
["xvii","在贸易过程中，AQSIQ将根据乌兹别克斯坦樱桃疫情发生动态及截获情况开展进一步的风险评估，并与MAWR协商，以适时调整检疫性有害生物名单及相应的检疫措施。为确保有关风险管理措施和操作要求的有效落实，AQSIQ和MAWR将按照相应的程序和规章对本议定书执行情况进行审核和评估。",null,null,null,null,null,null,null,null,null,null,null,null,null,null,null,null,null,null,null,null,null,null,null,null,null,null,null,null,null,null,null,null,null,null,null,null,17,"","",{"$f":"IF(OR($AN52=\"\",$AO52=\"\"),\"\",INDEX('Uncertainy tables (Beta)'!$G$7:$J$31,(($AN52-1)*5)+1,$AO52))","v":""},{"$f":"IF(OR($AN52=\"\",$AO52=\"\"),\"\",INDEX('Uncertainy tables (Beta)'!$G$7:$J$31,(($AN52-1)*5)+2,$AO52))","v":""},{"$f":"IF(OR($AN52=\"\",$AO52=\"\"),\"\",INDEX('Uncertainy tables (Beta)'!$G$7:$J$31,(($AN52-1)*5)+3,$AO52))","v":""},{"$f":"IF(OR($AN52=\"\",$AO52=\"\"),\"\",INDEX('Uncertainy tables (Beta)'!$G$7:$J$31,(($AN52-1)*5)+4,$AO52))","v":""},{"$f":"IF(OR($AN52=\"\",$AO52=\"\"),\"\",INDEX('Uncertainy tables (Beta)'!$G$7:$J$31,(($AN52-1)*5)+5,$AO52))","v":""},null,"","",{"$f":"IF(OR($AV52=\"\",$AW52=\"\"),\"\",INDEX('Uncertainy tables (Beta)'!$G$7:$J$31,(($AV52-1)*5)+1,$AW52))","v":""},{"$f":"IF(OR($AV52=\"\",$AW52=\"\"),\"\",INDEX('Uncertainy tables (Beta)'!$G$7:$J$31,(($AV52-1)*5)+2,$AW52))","v":""},{"$f":"IF(OR($AV52=\"\",$AW52=\"\"),\"\",INDEX('Uncertainy tables (Beta)'!$G$7:$J$31,(($AV52-1)*5)+3,$AW52))","v":""},{"$f":"IF(OR($AV52=\"\",$AW52=\"\"),\"\",INDEX('Uncertainy tables (Beta)'!$G$7:$J$31,(($AV52-1)*5)+4,$AW52))","v":""},{"$f":"IF(OR($AV52=\"\",$AW52=\"\"),\"\",INDEX('Uncertainy tables (Beta)'!$G$7:$J$31,(($AV52-1)*5)+5,$AW52))","v":""},null,"","",{"$f":"IF(OR($BD52=\"\",$BE52=\"\"),\"\",INDEX('Uncertainy tables (Beta)'!$G$7:$J$31,(($BD52-1)*5)+1,$BE52))","v":""},{"$f":"IF(OR($BD52=\"\",$BE52=\"\"),\"\",INDEX('Uncertainy tables (Beta)'!$G$7:$J$31,(($BD52-1)*5)+2,$BE52))","v":""},{"$f":"IF(OR($BD52=\"\",$BE52=\"\"),\"\",INDEX('Uncertainy tables (Beta)'!$G$7:$J$31,(($BD52-1)*5)+3,$BE52))","v":""},{"$f":"IF(OR($BD52=\"\",$BE52=\"\"),\"\",INDEX('Uncertainy tables (Beta)'!$G$7:$J$31,(($BD52-1)*5)+4,$BE52))","v":""},{"$f":"IF(OR($BD52=\"\",$BE52=\"\"),\"\",INDEX('Uncertainy tables (Beta)'!$G$7:$J$31,(($BD52-1)*5)+5,$BE52))","v":""},null,"","",{"$f":"IF(OR($BL52=\"\",$BM52=\"\"),\"\",INDEX('Uncertainy tables (Beta)'!$G$7:$J$31,(($BL52-1)*5)+1,$BM52))","v":""},{"$f":"IF(OR($BL52=\"\",$BM52=\"\"),\"\",INDEX('Uncertainy tables (Beta)'!$G$7:$J$31,(($BL52-1)*5)+2,$BM52))","v":""},{"$f":"IF(OR($BL52=\"\",$BM52=\"\"),\"\",INDEX('Uncertainy tables (Beta)'!$G$7:$J$31,(($BL52-1)*5)+3,$BM52))","v":""},{"$f":"IF(OR($BL52=\"\",$BM52=\"\"),\"\",INDEX('Uncertainy tables (Beta)'!$G$7:$J$31,(($BL52-1)*5)+4,$BM52))","v":""},{"$f":"IF(OR($BL52=\"\",$BM52=\"\"),\"\",INDEX('Uncertainy tables (Beta)'!$G$7:$J$31,(($BL52-1)*5)+5,$BM52))","v":""}]
["xviii","",null,null,null,null,null,null,null,null,null,null,null,null,null,null,null,null,null,null,null,null,null,null,null,null,null,null,null,null,null,null,null,null,null,null,null,null,18,"","",{"$f":"IF(OR($AN53=\"\",$AO53=\"\"),\"\",INDEX('Uncertainy tables (Beta)'!$G$7:$J$31,(($AN53-1)*5)+1,$AO53))","v":""},{"$f":"IF(OR($AN53=\"\",$AO53=\"\"),\"\",INDEX('Uncertainy tables (Beta)'!$G$7:$J$31,(($AN53-1)*5)+2,$AO53))","v":""},{"$f":"IF(OR($AN53=\"\",$AO53=\"\"),\"\",INDEX('Uncertainy tables (Beta)'!$G$7:$J$31,(($AN53-1)*5)+3,$AO53))","v":""},{"$f":"IF(OR($AN53=\"\",$AO53=\"\"),\"\",INDEX('Uncertainy tables (Beta)'!$G$7:$J$31,(($AN53-1)*5)+4,$AO53))","v":""},{"$f":"IF(OR($AN53=\"\",$AO53=\"\"),\"\",INDEX('Uncertainy tables (Beta)'!$G$7:$J$31,(($AN53-1)*5)+5,$AO53))","v":""},null,"","",{"$f":"IF(OR($AV53=\"\",$AW53=\"\"),\"\",INDEX('Uncertainy tables (Beta)'!$G$7:$J$31,(($AV53-1)*5)+1,$AW53))","v":""},{"$f":"IF(OR($AV53=\"\",$AW53=\"\"),\"\",INDEX('Uncertainy tables (Beta)'!$G$7:$J$31,(($AV53-1)*5)+2,$AW53))","v":""},{"$f":"IF(OR($AV53=\"\",$AW53=\"\"),\"\",INDEX('Uncertainy tables (Beta)'!$G$7:$J$31,(($AV53-1)*5)+3,$AW53))","v":""},{"$f":"IF(OR($AV53=\"\",$AW53=\"\"),\"\",INDEX('Uncertainy tables (Beta)'!$G$7:$J$31,(($AV53-1)*5)+4,$AW53))","v":""},{"$f":"IF(OR($AV53=\"\",$AW53=\"\"),\"\",INDEX('Uncertainy tables (Beta)'!$G$7:$J$31,(($AV53-1)*5)+5,$AW53))","v":""},null,"","",{"$f":"IF(OR($BD53=\"\",$BE53=\"\"),\"\",INDEX('Uncertainy tables (Beta)'!$G$7:$J$31,(($BD53-1)*5)+1,$BE53))","v":""},{"$f":"IF(OR($BD53=\"\",$BE53=\"\"),\"\",INDEX('Uncertainy tables (Beta)'!$G$7:$J$31,(($BD53-1)*5)+2,$BE53))","v":""},{"$f":"IF(OR($BD53=\"\",$BE53=\"\"),\"\",INDEX('Uncertainy tables (Beta)'!$G$7:$J$31,(($BD53-1)*5)+3,$BE53))","v":""},{"$f":"IF(OR($BD53=\"\",$BE53=\"\"),\"\",INDEX('Uncertainy tables (Beta)'!$G$7:$J$31,(($BD53-1)*5)+4,$BE53))","v":""},{"$f":"IF(OR($BD53=\"\",$BE53=\"\"),\"\",INDEX('Uncertainy tables (Beta)'!$G$7:$J$31,(($BD53-1)*5)+5,$BE53))","v":""},null,"","",{"$f":"IF(OR($BL53=\"\",$BM53=\"\"),\"\",INDEX('Uncertainy tables (Beta)'!$G$7:$J$31,(($BL53-1)*5)+1,$BM53))","v":""},{"$f":"IF(OR($BL53=\"\",$BM53=\"\"),\"\",INDEX('Uncertainy tables (Beta)'!$G$7:$J$31,(($BL53-1)*5)+2,$BM53))","v":""},{"$f":"IF(OR($BL53=\"\",$BM53=\"\"),\"\",INDEX('Uncertainy tables (Beta)'!$G$7:$J$31,(($BL53-1)*5)+3,$BM53))","v":""},{"$f":"IF(OR($BL53=\"\",$BM53=\"\"),\"\",INDEX('Uncertainy tables (Beta)'!$G$7:$J$31,(($BL53-1)*5)+4,$BM53))","v":""},{"$f":"IF(OR($BL53=\"\",$BM53=\"\"),\"\",INDEX('Uncertainy tables (Beta)'!$G$7:$J$31,(($BL53-1)*5)+5,$BM53))","v":""}]
["xix","",null,null,null,null,null,null,null,null,null,null,null,null,null,null,null,null,null,null,null,null,null,null,null,null,null,null,null,null,null,null,null,null,null,null,null,null,19,"","",{"$f":"IF(OR($AN54=\"\",$AO54=\"\"),\"\",INDEX('Uncertainy tables (Beta)'!$G$7:$J$31,(($AN54-1)*5)+1,$AO54))","v":""},{"$f":"IF(OR($AN54=\"\",$AO54=\"\"),\"\",INDEX('Uncertainy tables (Beta)'!$G$7:$J$31,(($AN54-1)*5)+2,$AO54))","v":""},{"$f":"IF(OR($AN54=\"\",$AO54=\"\"),\"\",INDEX('Uncertainy tables (Beta)'!$G$7:$J$31,(($AN54-1)*5)+3,$AO54))","v":""},{"$f":"IF(OR($AN54=\"\",$AO54=\"\"),\"\",INDEX('Uncertainy tables (Beta)'!$G$7:$J$31,(($AN54-1)*5)+4,$AO54))","v":""},{"$f":"IF(OR($AN54=\"\",$AO54=\"\"),\"\",INDEX('Uncertainy tables (Beta)'!$G$7:$J$31,(($AN54-1)*5)+5,$AO54))","v":""},null,"","",{"$f":"IF(OR($AV54=\"\",$AW54=\"\"),\"\",INDEX('Uncertainy tables (Beta)'!$G$7:$J$31,(($AV54-1)*5)+1,$AW54))","v":""},{"$f":"IF(OR($AV54=\"\",$AW54=\"\"),\"\",INDEX('Uncertainy tables (Beta)'!$G$7:$J$31,(($AV54-1)*5)+2,$AW54))","v":""},{"$f":"IF(OR($AV54=\"\",$AW54=\"\"),\"\",INDEX('Uncertainy tables (Beta)'!$G$7:$J$31,(($AV54-1)*5)+3,$AW54))","v":""},{"$f":"IF(OR($AV54=\"\",$AW54=\"\"),\"\",INDEX('Uncertainy tables (Beta)'!$G$7:$J$31,(($AV54-1)*5)+4,$AW54))","v":""},{"$f":"IF(OR($AV54=\"\",$AW54=\"\"),\"\",INDEX('Uncertainy tables (Beta)'!$G$7:$J$31,(($AV54-1)*5)+5,$AW54))","v":""},null,"","",{"$f":"IF(OR($BD54=\"\",$BE54=\"\"),\"\",INDEX('Uncertainy tables (Beta)'!$G$7:$J$31,(($BD54-1)*5)+1,$BE54))","v":""},{"$f":"IF(OR($BD54=\"\",$BE54=\"\"),\"\",INDEX('Uncertainy tables (Beta)'!$G$7:$J$31,(($BD54-1)*5)+2,$BE54))","v":""},{"$f":"IF(OR($BD54=\"\",$BE54=\"\"),\"\",INDEX('Uncertainy tables (Beta)'!$G$7:$J$31,(($BD54-1)*5)+3,$BE54))","v":""},{"$f":"IF(OR($BD54=\"\",$BE54=\"\"),\"\",INDEX('Uncertainy tables (Beta)'!$G$7:$J$31,(($BD54-1)*5)+4,$BE54))","v":""},{"$f":"IF(OR($BD54=\"\",$BE54=\"\"),\"\",INDEX('Uncertainy tables (Beta)'!$G$7:$J$31,(($BD54-1)*5)+5,$BE54))","v":""},null,"","",{"$f":"IF(OR($BL54=\"\",$BM54=\"\"),\"\",INDEX('Uncertainy tables (Beta)'!$G$7:$J$31,(($BL54-1)*5)+1,$BM54))","v":""},{"$f":"IF(OR($BL54=\"\",$BM54=\"\"),\"\",INDEX('Uncertainy tables (Beta)'!$G$7:$J$31,(($BL54-1)*5)+2,$BM54))","v":""},{"$f":"IF(OR($BL54=\"\",$BM54=\"\"),\"\",INDEX('Uncertainy tables (Beta)'!$G$7:$J$31,(($BL54-1)*5)+3,$BM54))","v":""},{"$f":"IF(OR($BL54=\"\",$BM54=\"\"),\"\",INDEX('Uncertainy tables (Beta)'!$G$7:$J$31,(($BL54-1)*5)+4,$BM54))","v":""},{"$f":"IF(OR($BL54=\"\",$BM54=\"\"),\"\",INDEX('Uncertainy tables (Beta)'!$G$7:$J$31,(($BL54-1)*5)+5,$BM54))","v":""}]
["xx","",null,null,null,null,null,null,null,null,null,null,null,null,null,null,null,null,null,null,null,null,null,null,null,null,null,null,null,null,null,null,null,null,null,null,null,null,20,"","",{"$f":"IF(OR($AN55=\"\",$AO55=\"\"),\"\",INDEX('Uncertainy tables (Beta)'!$G$7:$J$31,(($AN55-1)*5)+1,$AO55))","v":""},{"$f":"IF(OR($AN55=\"\",$AO55=\"\"),\"\",INDEX('Uncertainy tables (Beta)'!$G$7:$J$31,(($AN55-1)*5)+2,$AO55))","v":""},{"$f":"IF(OR($AN55=\"\",$AO55=\"\"),\"\",INDEX('Uncertainy tables (Beta)'!$G$7:$J$31,(($AN55-1)*5)+3,$AO55))","v":""},{"$f":"IF(OR($AN55=\"\",$AO55=\"\"),\"\",INDEX('Uncertainy tables (Beta)'!$G$7:$J$31,(($AN55-1)*5)+4,$AO55))","v":""},{"$f":"IF(OR($AN55=\"\",$AO55=\"\"),\"\",INDEX('Uncertainy tables (Beta)'!$G$7:$J$31,(($AN55-1)*5)+5,$AO55))","v":""},null,"","",{"$f":"IF(OR($AV55=\"\",$AW55=\"\"),\"\",INDEX('Uncertainy tables (Beta)'!$G$7:$J$31,(($AV55-1)*5)+1,$AW55))","v":""},{"$f":"IF(OR($AV55=\"\",$AW55=\"\"),\"\",INDEX('Uncertainy tables (Beta)'!$G$7:$J$31,(($AV55-1)*5)+2,$AW55))","v":""},{"$f":"IF(OR($AV55=\"\",$AW55=\"\"),\"\",INDEX('Uncertainy tables (Beta)'!$G$7:$J$31,(($AV55-1)*5)+3,$AW55))","v":""},{"$f":"IF(OR($AV55=\"\",$AW55=\"\"),\"\",INDEX('Uncertainy tables (Beta)'!$G$7:$J$31,(($AV55-1)*5)+4,$AW55))","v":""},{"$f":"IF(OR($AV55=\"\",$AW55=\"\"),\"\",INDEX('Uncertainy tables (Beta)'!$G$7:$J$31,(($AV55-1)*5)+5,$AW55))","v":""},null,"","",{"$f":"IF(OR($BD55=\"\",$BE55=\"\"),\"\",INDEX('Uncertainy tables (Beta)'!$G$7:$J$31,(($BD55-1)*5)+1,$BE55))","v":""},{"$f":"IF(OR($BD55=\"\",$BE55=\"\"),\"\",INDEX('Uncertainy tables (Beta)'!$G$7:$J$31,(($BD55-1)*5)+2,$BE55))","v":""},{"$f":"IF(OR($BD55=\"\",$BE55=\"\"),\"\",INDEX('Uncertainy tables (Beta)'!$G$7:$J$31,(($BD55-1)*5)+3,$BE55))","v":""},{"$f":"IF(OR($BD55=\"\",$BE55=\"\"),\"\",INDEX('Uncertainy tables (Beta)'!$G$7:$J$31,(($BD55-1)*5)+4,$BE55))","v":""},{"$f":"IF(OR($BD55=\"\",$BE55=\"\"),\"\",INDEX('Uncertainy tables (Beta)'!$G$7:$J$31,(($BD55-1)*5)+5,$BE55))","v":""},null,"","",{"$f":"IF(OR($BL55=\"\",$BM55=\"\"),\"\",INDEX('Uncertainy tables (Beta)'!$G$7:$J$31,(($BL55-1)*5)+1,$BM55))","v":""},{"$f":"IF(OR($BL55=\"\",$BM55=\"\"),\"\",INDEX('Uncertainy tables (Beta)'!$G$7:$J$31,(($BL55-1)*5)+2,$BM55))","v":""},{"$f":"IF(OR($BL55=\"\",$BM55=\"\"),\"\",INDEX('Uncertainy tables (Beta)'!$G$7:$J$31,(($BL55-1)*5)+3,$BM55))","v":""},{"$f":"IF(OR($BL55=\"\",$BM55=\"\"),\"\",INDEX('Uncertainy tables (Beta)'!$G$7:$J$31,(($BL55-1)*5)+4,$BM55))","v":""},{"$f":"IF(OR($BL55=\"\",$BM55=\"\"),\"\",INDEX('Uncertainy tables (Beta)'!$G$7:$J$31,(($BL55-1)*5)+5,$BM55))","v":""}]
[]
[]
[]
[]
[]
[]
[]
[]
[{"$f":"IF(OR(ISBLANK('Part A - Importing'!D7),ISBLANK('Part A - Importing'!D9),ISBLANK('Part A - Importing'!D10),ISBLANK('Part A - Importing'!D11)),\"表C3：整合系统方法措施\",\"表C3：整合来自 \"&'Part A - Importing'!D9&\" 的\"&'Part A - Importing'!D7&\" 之上/之中的\"&'Part A - Importing'!D11&\"的系统方法措施\")","v":"表C3：整合系统方法措施"}]
[null,"拟议的系统方法包的参考名称",null," 措施1"," 措施2"," 措施3"," 措施4"," 措施5"," 措施6"," 措施7"," 措施8"," 措施9"," 措施10"," 措施11"," 措施12"," 措施13"," 措施14"," 措施15"," 措施16"," 措施17"," 措施18"," 措施19"," 措施20"]
[null,"系统方法"]
[null,"目标",null,{"$f":"IF(VLOOKUP(D66,$B$11:$M$30,12,0)=0,\"-\",VLOOKUP(D66,$B$11:$M$30,12,0))","v":{"$error":"#N/A"}},{"$f":"IF(VLOOKUP(E66,$B$11:$M$30,12,0)=0,\"-\",VLOOKUP(E66,$B$11:$M$30,12,0))","v":{"$error":"#N/A"}},{"$error":"#N/A"},{"$error":"#N/A"},{"$error":"#N/A"},{"$error":"#N/A"},{"$error":"#N/A"},{"$error":"#N/A"},{"$error":"#N/A"},{"$error":"#N/A"},{"$error":"#N/A"},{"$error":"#N/A"},{"$error":"#N/A"},{"$error":"#N/A"},{"$error":"#N/A"},{"$error":"#N/A"},{"$error":"#N/A"},{"$error":"#N/A"},{"$error":"#N/A"},{"$error":"#N/A"}]
["Indicator",{"$f":"$C$8","v":"对降低出口货物中侵染有害生物风险的贡献"},"评分：",{"$f":"IF(VLOOKUP(D$66,$B$11:$M$30,2,0)=0,\"-\",VLOOKUP(D$66,$B$11:$M$30,2,0))","v":{"$error":"#N/A"}},{"$error":"#N/A"},{"$error":"#N/A"},{"$error":"#N/A"},{"$error":"#N/A"},{"$error":"#N/A"},{"$error":"#N/A"},{"$error":"#N/A"},{"$error":"#N/A"},{"$error":"#N/A"},{"$error":"#N/A"},{"$error":"#N/A"},{"$error":"#N/A"},{"$error":"#N/A"},{"$error":"#N/A"},{"$error":"#N/A"},{"$error":"#N/A"},{"$error":"#N/A"},{"$error":"#N/A"},{"$error":"#N/A"}]
[null,null,"不确定度：",{"$f":"IF(VLOOKUP(D$66,$B$11:$M$30,3,0)=0,\"-\",VLOOKUP(D$66,$B$11:$M$30,3,0))","v":{"$error":"#N/A"}},{"$error":"#N/A"},{"$error":"#N/A"},{"$error":"#N/A"},{"$error":"#N/A"},{"$error":"#N/A"},{"$error":"#N/A"},{"$error":"#N/A"},{"$error":"#N/A"},{"$error":"#N/A"},{"$error":"#N/A"},{"$error":"#N/A"},{"$error":"#N/A"},{"$error":"#N/A"},{"$error":"#N/A"},{"$error":"#N/A"},{"$error":"#N/A"},{"$error":"#N/A"},{"$error":"#N/A"},{"$error":"#N/A"}]
[null,{"$f":"$F$8","v":"实施标准"},"评分：",{"$f":"IF(VLOOKUP(D$66,$B$11:$M$30,5,0)=0,\"-\",VLOOKUP(D$66,$B$11:$M$30,5,0))","v":{"$error":"#N/A"}},{"$f":"IF(VLOOKUP(E$66,$B$11:$M$30,5,0)=0,\"-\",VLOOKUP(E$66,$B$11:$M$30,5,0))","v":{"$error":"#N/A"}},{"$error":"#N/A"},{"$error":"#N/A"},{"$error":"#N/A"},{"$error":"#N/A"},{"$error":"#N/A"},{"$error":"#N/A"},{"$error":"#N/A"},{"$error":"#N/A"},{"$error":"#N/A"},{"$error":"#N/A"},{"$error":"#N/A"},{"$error":"#N/A"},{"$error":"#N/A"},{"$error":"#N/A"},{"$error":"#N/A"},{"$error":"#N/A"},{"$error":"#N/A"},{"$error":"#N/A"}]
[null,null,"不确定度：",{"$f":"IF(VLOOKUP(D$66,$B$11:$M$30,6,0)=0,\"-\",VLOOKUP(D$66,$B$11:$M$30,6,0))","v":{"$error":"#N/A"}},{"$f":"IF(VLOOKUP(E$66,$B$11:$M$30,6,0)=0,\"-\",VLOOKUP(E$66,$B$11:$M$30,6,0))","v":{"$error":"#N/A"}},{"$error":"#N/A"},{"$error":"#N/A"},{"$error":"#N/A"},{"$error":"#N/A"},{"$error":"#N/A"},{"$error":"#N/A"},{"$error":"#N/A"},{"$error":"#N/A"},{"$error":"#N/A"},{"$error":"#N/A"},{"$error":"#N/A"},{"$error":"#N/A"},{"$error":"#N/A"},{"$error":"#N/A"},{"$error":"#N/A"},{"$error":"#N/A"},{"$error":"#N/A"},{"$error":"#N/A"}]
[null,{"$f":"$C$33","v":"验证措施对控制点的影响的能力"},"评分：",{"$f":"IF(VLOOKUP(D$66,$B$36:$M$55,2,0)=0,\"-\",VLOOKUP(D$66,$B$36:$M$55,2,0))","v":{"$error":"#N/A"}},{"$f":"IF(VLOOKUP(E$66,$B$36:$M$55,2,0)=0,\"-\",VLOOKUP(E$66,$B$36:$M$55,2,0))","v":{"$error":"#N/A"}},{"$error":"#N/A"},{"$error":"#N/A"},{"$error":"#N/A"},{"$error":"#N/A"},{"$error":"#N/A"},{"$error":"#N/A"},{"$error":"#N/A"},{"$error":"#N/A"},{"$error":"#N/A"},{"$error":"#N/A"},{"$error":"#N/A"},{"$error":"#N/A"},{"$error":"#N/A"},{"$error":"#N/A"},{"$error":"#N/A"},{"$error":"#N/A"},{"$error":"#N/A"},{"$error":"#N/A"}]
[null,null,"不确定度：",{"$f":"IF(VLOOKUP(D$66,$B$36:$M$55,3,0)=0,\"-\",VLOOKUP(D$66,$B$36:$M$55,3,0))","v":{"$error":"#N/A"}},{"$f":"IF(VLOOKUP(E$66,$B$36:$M$55,3,0)=0,\"-\",VLOOKUP(E$66,$B$36:$M$55,3,0))","v":{"$error":"#N/A"}},{"$error":"#N/A"},{"$error":"#N/A"},{"$error":"#N/A"},{"$error":"#N/A"},{"$error":"#N/A"},{"$error":"#N/A"},{"$error":"#N/A"},{"$error":"#N/A"},{"$error":"#N/A"},{"$error":"#N/A"},{"$error":"#N/A"},{"$error":"#N/A"},{"$error":"#N/A"},{"$error":"#N/A"},{"$error":"#N/A"},{"$error":"#N/A"},{"$error":"#N/A"},{"$error":"#N/A"}]
[null,{"$f":"$F$33","v":"生产者可接受度"},"评分：",{"$f":"IF(VLOOKUP(D$66,$B$36:$M$55,5,0)=0,\"-\",VLOOKUP(D$66,$B$36:$M$55,5,0))","v":{"$error":"#N/A"}},{"$f":"IF(VLOOKUP(E$66,$B$36:$M$55,5,0)=0,\"-\",VLOOKUP(E$66,$B$36:$M$55,5,0))","v":{"$error":"#N/A"}},{"$error":"#N/A"},{"$error":"#N/A"},{"$error":"#N/A"},{"$error":"#N/A"},{"$error":"#N/A"},{"$error":"#N/A"},{"$error":"#N/A"},{"$error":"#N/A"},{"$error":"#N/A"},{"$error":"#N/A"},{"$error":"#N/A"},{"$error":"#N/A"},{"$error":"#N/A"},{"$error":"#N/A"},{"$error":"#N/A"},{"$error":"#N/A"},{"$error":"#N/A"},{"$error":"#N/A"}]
[null,null,"不确定度：",{"$f":"IF(VLOOKUP(D$66,$B$36:$M$55,6,0)=0,\"-\",VLOOKUP(D$66,$B$36:$M$55,6,0))","v":{"$error":"#N/A"}},{"$f":"IF(VLOOKUP(E$66,$B$36:$M$55,6,0)=0,\"-\",VLOOKUP(E$66,$B$36:$M$55,6,0))","v":{"$error":"#N/A"}},{"$error":"#N/A"},{"$error":"#N/A"},{"$error":"#N/A"},{"$error":"#N/A"},{"$error":"#N/A"},{"$error":"#N/A"},{"$error":"#N/A"},{"$error":"#N/A"},{"$error":"#N/A"},{"$error":"#N/A"},{"$error":"#N/A"},{"$error":"#N/A"},{"$error":"#N/A"},{"$error":"#N/A"},{"$error":"#N/A"},{"$error":"#N/A"},{"$error":"#N/A"},{"$error":"#N/A"}]
[null,{"$f":"$I$33","v":"行业可接受度"},"评分：",{"$f":"IF(VLOOKUP(D$66,$B$36:$M$55,8,0)=0,\"-\",VLOOKUP(D$66,$B$36:$M$55,8,0))","v":{"$error":"#N/A"}},{"$f":"IF(VLOOKUP(E$66,$B$36:$M$55,8,0)=0,\"-\",VLOOKUP(E$66,$B$36:$M$55,8,0))","v":{"$error":"#N/A"}},{"$error":"#N/A"},{"$error":"#N/A"},{"$error":"#N/A"},{"$error":"#N/A"},{"$error":"#N/A"},{"$error":"#N/A"},{"$error":"#N/A"},{"$error":"#N/A"},{"$error":"#N/A"},{"$error":"#N/A"},{"$error":"#N/A"},{"$error":"#N/A"},{"$error":"#N/A"},{"$error":"#N/A"},{"$error":"#N/A"},{"$error":"#N/A"},{"$error":"#N/A"},{"$error":"#N/A"}]
[null,null,"不确定度：",{"$f":"IF(VLOOKUP(D$66,$B$36:$M$55,9,0)=0,\"-\",VLOOKUP(D$66,$B$36:$M$55,9,0))","v":{"$error":"#N/A"}},{"$f":"IF(VLOOKUP(E$66,$B$36:$M$55,9,0)=0,\"-\",VLOOKUP(E$66,$B$36:$M$55,9,0))","v":{"$error":"#N/A"}},{"$error":"#N/A"},{"$error":"#N/A"},{"$error":"#N/A"},{"$error":"#N/A"},{"$error":"#N/A"},{"$error":"#N/A"},{"$error":"#N/A"},{"$error":"#N/A"},{"$error":"#N/A"},{"$error":"#N/A"},{"$error":"#N/A"},{"$error":"#N/A"},{"$error":"#N/A"},{"$error":"#N/A"},{"$error":"#N/A"},{"$error":"#N/A"},{"$error":"#N/A"},{"$error":"#N/A"}]
[null,{"$f":"$L$33","v":"社会可接受度 "},"评分：",{"$f":"IF(VLOOKUP(D$66,$B$36:$M$55,11,0)=0,\"-\",VLOOKUP(D$66,$B$36:$M$55,11,0))","v":{"$error":"#N/A"}},{"$f":"IF(VLOOKUP(E$66,$B$36:$M$55,11,0)=0,\"-\",VLOOKUP(E$66,$B$36:$M$55,11,0))","v":{"$error":"#N/A"}},{"$error":"#N/A"},{"$error":"#N/A"},{"$error":"#N/A"},{"$error":"#N/A"},{"$error":"#N/A"},{"$error":"#N/A"},{"$error":"#N/A"},{"$error":"#N/A"},{"$error":"#N/A"},{"$error":"#N/A"},{"$error":"#N/A"},{"$error":"#N/A"},{"$error":"#N/A"},{"$error":"#N/A"},{"$error":"#N/A"},{"$error":"#N/A"},{"$error":"#N/A"},{"$error":"#N/A"}]
[null,null,"不确定度：",{"$f":"IF(VLOOKUP(D$66,$B$36:$M$55,12,0)=0,\"-\",VLOOKUP(D$66,$B$36:$M$55,12,0))","v":{"$error":"#N/A"}},{"$f":"IF(VLOOKUP(E$66,$B$36:$M$55,12,0)=0,\"-\",VLOOKUP(E$66,$B$36:$M$55,12,0))","v":{"$error":"#N/A"}},{"$error":"#N/A"},{"$error":"#N/A"},{"$error":"#N/A"},{"$error":"#N/A"},{"$error":"#N/A"},{"$error":"#N/A"},{"$error":"#N/A"},{"$error":"#N/A"},{"$error":"#N/A"},{"$error":"#N/A"},{"$error":"#N/A"},{"$error":"#N/A"},{"$error":"#N/A"},{"$error":"#N/A"},{"$error":"#N/A"},{"$error":"#N/A"},{"$error":"#N/A"},{"$error":"#N/A"}]
[]
[null,null,null,null,null,null,null,null,null,null,null,null,null,null,null,null,null,null,null,null,null,null,null,null,null,null,null,null,null,null,null,null,null,null,null,null,null,null,null,null,null,{"$f":"A82","v":"表C4：系统方法的总体预期绩效"}]
[{"$f":"IF(OR(ISBLANK('Part A - Importing'!D7),ISBLANK('Part A - Importing'!D9),ISBLANK('Part A - Importing'!D10),ISBLANK('Part A - Importing'!D11)),\"表C4：系统方法的总体预期绩效\",\"表C4.A部分：来自 \"&'Part A - Importing'!D9&\" 的\"&'Part A - Importing'!D7&\" 之上/之中的\"&'Part A - Importing'!D11&\"的系统方法总体预期绩效\")","v":"表C4：系统方法的总体预期绩效"},null,null,null,null,null,null,null,null,null,null,null,null,null,null,null,null,null,null,null,null,null,null,null,null,null,null,null,null,null,null,null,null,null,null,null,null,null,null,null,null,{"$f":"AP83","v":"非常低\t"},{"$f":"AQ83","v":"低"},{"$f":"AR83","v":"中"},{"$f":"AS83","v":"高"},{"$f":"AT83","v":"非常高"}]
[null,"系统方法包","对系统方法的预期整体绩效进行评分",null,null,"其他说明",null,null,null,null,null,null,null,null,null,null,null,null,null,null,null,null,null,null,null,null,null,null,null,null,null,null,null,null,null,null,null,null,null,null,null,{"$f":"AP84","v":"非常低\t"},{"$f":"AQ84","v":"低"},{"$f":"AR84","v":"中"},{"$f":"AS84","v":"高"},{"$f":"AT84","v":"非常高"}]
[null,null,"评分","不确定性","图表","验证措施的方法",null,null,null,null,null,null,null,null,null,null,null,null,null,null,null,null,null,null,null,null,null,null,null,null,null,null,null,null,null,null,null,null,null,"Rating","Uncertainty",{"$f":"A98","v":"非常低\t"},{"$f":"A99","v":"低"},{"$f":"A100","v":"中"},{"$f":"A101","v":"高"},{"$f":"A102","v":"非常高"}]
[null,{"$f":"IF(B66=0,\"\",B66)","v":"系统方法"},null,null,null,null,null,null,null,null,null,null,null,null,null,null,null,null,null,null,null,null,null,null,null,null,null,null,null,null,null,null,null,null,null,null,null,null,null,{"$f":"IF(C85=$A$98,1,IF(C85=$A$99,2,IF(C85=$A$100,3,IF(C85=$A$101,4,IF(C85=$A$102,5,\"\")))))","v":""},{"$f":"IF(D85=$B$98,1,IF(D85=$B$99,2,IF(D85=$B$100,3,IF(D85=$B$101,4,\"\"))))","v":""},{"$f":"IF(OR($AN85=\"\",$AO85=\"\"),\"\",INDEX('Uncertainy tables (Beta)'!$G$7:$J$31,(($AN85-1)*5)+1,$AO85))","v":""},{"$f":"IF(OR($AN85=\"\",$AO85=\"\"),\"\",INDEX('Uncertainy tables (Beta)'!$G$7:$J$31,(($AN85-1)*5)+2,$AO85))","v":""},{"$f":"IF(OR($AN85=\"\",$AO85=\"\"),\"\",INDEX('Uncertainy tables (Beta)'!$G$7:$J$31,(($AN85-1)*5)+3,$AO85))","v":""},{"$f":"IF(OR($AN85=\"\",$AO85=\"\"),\"\",INDEX('Uncertainy tables (Beta)'!$G$7:$J$31,(($AN85-1)*5)+4,$AO85))","v":""},{"$f":"IF(OR($AN85=\"\",$AO85=\"\"),\"\",INDEX('Uncertainy tables (Beta)'!$G$7:$J$31,(($AN85-1)*5)+5,$AO85))","v":""}]
[]
[]
[]
[]
[]
[]
[]
[]
[]
["下拉框文本"]
["评级","不确定性"]
[]
["非常低\t","非常低\t"]
["低","低"]
["中","中"]
["高","高"]
["非常高"]
[]
[]
[]
[]
[]
[null,"页面上的数据条目数",{"$f":"COUNTA(C11:D30,F11:G30,I11:L30,C36:D55,F36:G55,I36:J55,L36:M55,D66:W66,C85:D85,F85:G85)","v":0}]

{"sheet":"Part C - Add Coms Exporting","index":7,"n_rows":74,"n_cols":22,"rows_kept":74,"cut":false,"hidden":true,"merged":[[2,9,2,10],[6,0,6,7],[6,8,6,12],[7,2,7,4],[7,5,7,7],[8,2,8,4],[8,5,8,7],[10,8,10,9],[10,10,10,11],[11,8,11,9],[11,10,11,11],[12,8,12,9],[12,10,12,11],[13,8,13,9],[13,10,13,11],[14,8,14,9],[14,10,14,11],[15,8,15,9],[15,10,15,11],[16,8,16,9],[16,10,16,11],[17,8,17,9],[17,10,17,11],[18,8,18,9],[18,10,18,11],[19,8,19,9],[19,10,19,11],[20,8,20,9],[20,10,20,11],[21,8,21,9],[21,10,21,11],[22,8,22,9],[22,10,22,11],[23,8,23,9],[23,10,23,11],[24,8,24,9],[24,10,24,11],[25,8,25,9],[25,10,25,11],[26,8,26,9],[26,10,26,11],[27,8,27,9],[27,10,27,11],[28,8,28,9],[28,10,28,11],[29,8,29,9],[29,10,29,11],[31,0,31,13],[32,2,32,4],[32,5,32,7],[32,8,32,10],[32,11,32,13],[33,2,33,4],[33,5,33,7],[33,8,33,10],[33,11,33,13],[63,0,63,21],[70,0,70,6],[71,2,71,4],[73,5,73,6],[7,0,9,0],[32,0,33,0],[7,1,9,1],[32,1,33,1],[7,12,9,12],[71,5,72,6],[7,8,9,9],[7,10,9,11]]}
[null,{"$f":"Main!B1","v":"全球超越合规 — 系统方法决策支持（DSSA）"}]
[null,{"$f":"IF(OR(ISBLANK('Part A - Exporting'!D7),ISBLANK('Part A - Exporting'!D9),ISBLANK('Part A - Exporting'!D10),ISBLANK('Part A - Exporting'!D11)),\"C部分意见：制定系统方法的评价措施\",\"C部分说明：开发从 \"&'Part A - Exporting'!D9&\" 到 \"&'Part A - Exporting'!D10&\"的\"&'Part A - Exporting'!D7&\" 贸易系统方法的措施评价\"&'Part A - Exporting'!D11)","v":"C部分意见：制定系统方法的评价措施"}]
[null,"出口版本"]
[]
[]
[]
["表C1.措施指标（降低有害生物风险和实施标准）",null,null,null,null,null,null,null,"可选说明"]
[null,"可用的系统方法措施（来自B部分）","对降低出口货物中侵染有害生物风险的贡献",null,null,"实施标准",null,null,"与其他措施的互动",null,"其他说明",null,"措施目标"]
[null,null,"该措施对降低有害生物风险的最大贡献是： ",null,null,"该措施实地实施标准是："]
[null,null,"评分","不确定性","说明","评分","不确定性","说明"]
["i",{"$f":"IF('Part C - Exporting'!B11=0,\"\",'Part C - Exporting'!B11)","v":""},{"$f":"IF('Part C - Exporting'!C11=0,\"\",'Part C - Exporting'!C11)","v":""},{"$f":"IF('Part C - Exporting'!D11=0,\"\",'Part C - Exporting'!D11)","v":""},null,{"$f":"IF('Part C - Exporting'!F11=0,\"\",'Part C - Exporting'!F11)","v":""},{"$f":"IF('Part C - Exporting'!G11=0,\"\",'Part C - Exporting'!G11)","v":""},null,{"$f":"IF('Part C - Exporting'!I11=0,\"\",'Part C - Exporting'!I11)","v":""},{"$f":"IF('Part C - Exporting'!J11=0,\"\",'Part C - Exporting'!J11)","v":""},{"$f":"IF('Part C - Exporting'!K11=0,\"\",'Part C - Exporting'!K11)","v":""},{"$f":"IF('Part C - Exporting'!L11=0,\"\",'Part C - Exporting'!L11)","v":""},{"$f":"IF('Part C - Exporting'!M11=0,\"\",'Part C - Exporting'!M11)","v":""}]
["ii",{"$f":"IF('Part C - Exporting'!B12=0,\"\",'Part C - Exporting'!B12)","v":""},{"$f":"IF('Part C - Exporting'!C12=0,\"\",'Part C - Exporting'!C12)","v":""},{"$f":"IF('Part C - Exporting'!D12=0,\"\",'Part C - Exporting'!D12)","v":""},null,{"$f":"IF('Part C - Exporting'!F12=0,\"\",'Part C - Exporting'!F12)","v":""},{"$f":"IF('Part C - Exporting'!G12=0,\"\",'Part C - Exporting'!G12)","v":""},null,{"$f":"IF('Part C - Exporting'!I12=0,\"\",'Part C - Exporting'!I12)","v":""},{"$f":"IF('Part C - Exporting'!J12=0,\"\",'Part C - Exporting'!J12)","v":""},{"$f":"IF('Part C - Exporting'!K12=0,\"\",'Part C - Exporting'!K12)","v":""},{"$f":"IF('Part C - Exporting'!L12=0,\"\",'Part C - Exporting'!L12)","v":""},{"$f":"IF('Part C - Exporting'!M12=0,\"\",'Part C - Exporting'!M12)","v":""}]
["iii",{"$f":"IF('Part C - Exporting'!B13=0,\"\",'Part C - Exporting'!B13)","v":""},{"$f":"IF('Part C - Exporting'!C13=0,\"\",'Part C - Exporting'!C13)","v":""},{"$f":"IF('Part C - Exporting'!D13=0,\"\",'Part C - Exporting'!D13)","v":""},null,{"$f":"IF('Part C - Exporting'!F13=0,\"\",'Part C - Exporting'!F13)","v":""},{"$f":"IF('Part C - Exporting'!G13=0,\"\",'Part C - Exporting'!G13)","v":""},null,{"$f":"IF('Part C - Exporting'!I13=0,\"\",'Part C - Exporting'!I13)","v":""},{"$f":"IF('Part C - Exporting'!J13=0,\"\",'Part C - Exporting'!J13)","v":""},{"$f":"IF('Part C - Exporting'!K13=0,\"\",'Part C - Exporting'!K13)","v":""},{"$f":"IF('Part C - Exporting'!L13=0,\"\",'Part C - Exporting'!L13)","v":""},{"$f":"IF('Part C - Exporting'!M13=0,\"\",'Part C - Exporting'!M13)","v":""}]
["iv",{"$f":"IF('Part C - Exporting'!B14=0,\"\",'Part C - Exporting'!B14)","v":""},{"$f":"IF('Part C - Exporting'!C14=0,\"\",'Part C - Exporting'!C14)","v":""},{"$f":"IF('Part C - Exporting'!D14=0,\"\",'Part C - Exporting'!D14)","v":""},null,{"$f":"IF('Part C - Exporting'!F14=0,\"\",'Part C - Exporting'!F14)","v":""},{"$f":"IF('Part C - Exporting'!G14=0,\"\",'Part C - Exporting'!G14)","v":""},null,{"$f":"IF('Part C - Exporting'!I14=0,\"\",'Part C - Exporting'!I14)","v":""},{"$f":"IF('Part C - Exporting'!J14=0,\"\",'Part C - Exporting'!J14)","v":""},{"$f":"IF('Part C - Exporting'!K14=0,\"\",'Part C - Exporting'!K14)","v":""},{"$f":"IF('Part C - Exporting'!L14=0,\"\",'Part C - Exporting'!L14)","v":""},{"$f":"IF('Part C - Exporting'!M14=0,\"\",'Part C - Exporting'!M14)","v":""}]
["v",{"$f":"IF('Part C - Exporting'!B15=0,\"\",'Part C - Exporting'!B15)","v":""},{"$f":"IF('Part C - Exporting'!C15=0,\"\",'Part C - Exporting'!C15)","v":""},{"$f":"IF('Part C - Exporting'!D15=0,\"\",'Part C - Exporting'!D15)","v":""},null,{"$f":"IF('Part C - Exporting'!F15=0,\"\",'Part C - Exporting'!F15)","v":""},{"$f":"IF('Part C - Exporting'!G15=0,\"\",'Part C - Exporting'!G15)","v":""},null,{"$f":"IF('Part C - Exporting'!I15=0,\"\",'Part C - Exporting'!I15)","v":""},{"$f":"IF('Part C - Exporting'!J15=0,\"\",'Part C - Exporting'!J15)","v":""},{"$f":"IF('Part C - Exporting'!K15=0,\"\",'Part C - Exporting'!K15)","v":""},{"$f":"IF('Part C - Exporting'!L15=0,\"\",'Part C - Exporting'!L15)","v":""},{"$f":"IF('Part C - Exporting'!M15=0,\"\",'Part C - Exporting'!M15)","v":""}]
["vi",{"$f":"IF('Part C - Exporting'!B16=0,\"\",'Part C - Exporting'!B16)","v":""},{"$f":"IF('Part C - Exporting'!C16=0,\"\",'Part C - Exporting'!C16)","v":""},{"$f":"IF('Part C - Exporting'!D16=0,\"\",'Part C - Exporting'!D16)","v":""},null,{"$f":"IF('Part C - Exporting'!F16=0,\"\",'Part C - Exporting'!F16)","v":""},{"$f":"IF('Part C - Exporting'!G16=0,\"\",'Part C - Exporting'!G16)","v":""},null,{"$f":"IF('Part C - Exporting'!I16=0,\"\",'Part C - Exporting'!I16)","v":""},{"$f":"IF('Part C - Exporting'!J16=0,\"\",'Part C - Exporting'!J16)","v":""},{"$f":"IF('Part C - Exporting'!K16=0,\"\",'Part C - Exporting'!K16)","v":""},{"$f":"IF('Part C - Exporting'!L16=0,\"\",'Part C - Exporting'!L16)","v":""},{"$f":"IF('Part C - Exporting'!M16=0,\"\",'Part C - Exporting'!M16)","v":""}]
["vii",{"$f":"IF('Part C - Exporting'!B17=0,\"\",'Part C - Exporting'!B17)","v":""},{"$f":"IF('Part C - Exporting'!C17=0,\"\",'Part C - Exporting'!C17)","v":""},{"$f":"IF('Part C - Exporting'!D17=0,\"\",'Part C - Exporting'!D17)","v":""},null,{"$f":"IF('Part C - Exporting'!F17=0,\"\",'Part C - Exporting'!F17)","v":""},{"$f":"IF('Part C - Exporting'!G17=0,\"\",'Part C - Exporting'!G17)","v":""},null,{"$f":"IF('Part C - Exporting'!I17=0,\"\",'Part C - Exporting'!I17)","v":""},{"$f":"IF('Part C - Exporting'!J17=0,\"\",'Part C - Exporting'!J17)","v":""},{"$f":"IF('Part C - Exporting'!K17=0,\"\",'Part C - Exporting'!K17)","v":""},{"$f":"IF('Part C - Exporting'!L17=0,\"\",'Part C - Exporting'!L17)","v":""},{"$f":"IF('Part C - Exporting'!M17=0,\"\",'Part C - Exporting'!M17)","v":""}]
["viii",{"$f":"IF('Part C - Exporting'!B18=0,\"\",'Part C - Exporting'!B18)","v":""},{"$f":"IF('Part C - Exporting'!C18=0,\"\",'Part C - Exporting'!C18)","v":""},{"$f":"IF('Part C - Exporting'!D18=0,\"\",'Part C - Exporting'!D18)","v":""},null,{"$f":"IF('Part C - Exporting'!F18=0,\"\",'Part C - Exporting'!F18)","v":""},{"$f":"IF('Part C - Exporting'!G18=0,\"\",'Part C - Exporting'!G18)","v":""},null,{"$f":"IF('Part C - Exporting'!I18=0,\"\",'Part C - Exporting'!I18)","v":""},{"$f":"IF('Part C - Exporting'!J18=0,\"\",'Part C - Exporting'!J18)","v":""},{"$f":"IF('Part C - Exporting'!K18=0,\"\",'Part C - Exporting'!K18)","v":""},{"$f":"IF('Part C - Exporting'!L18=0,\"\",'Part C - Exporting'!L18)","v":""},{"$f":"IF('Part C - Exporting'!M18=0,\"\",'Part C - Exporting'!M18)","v":""}]
["ix",{"$f":"IF('Part C - Exporting'!B19=0,\"\",'Part C - Exporting'!B19)","v":""},{"$f":"IF('Part C - Exporting'!C19=0,\"\",'Part C - Exporting'!C19)","v":""},{"$f":"IF('Part C - Exporting'!D19=0,\"\",'Part C - Exporting'!D19)","v":""},null,{"$f":"IF('Part C - Exporting'!F19=0,\"\",'Part C - Exporting'!F19)","v":""},{"$f":"IF('Part C - Exporting'!G19=0,\"\",'Part C - Exporting'!G19)","v":""},null,{"$f":"IF('Part C - Exporting'!I19=0,\"\",'Part C - Exporting'!I19)","v":""},{"$f":"IF('Part C - Exporting'!J19=0,\"\",'Part C - Exporting'!J19)","v":""},{"$f":"IF('Part C - Exporting'!K19=0,\"\",'Part C - Exporting'!K19)","v":""},{"$f":"IF('Part C - Exporting'!L19=0,\"\",'Part C - Exporting'!L19)","v":""},{"$f":"IF('Part C - Exporting'!M19=0,\"\",'Part C - Exporting'!M19)","v":""}]
["x",{"$f":"IF('Part C - Exporting'!B20=0,\"\",'Part C - Exporting'!B20)","v":""},{"$f":"IF('Part C - Exporting'!C20=0,\"\",'Part C - Exporting'!C20)","v":""},{"$f":"IF('Part C - Exporting'!D20=0,\"\",'Part C - Exporting'!D20)","v":""},null,{"$f":"IF('Part C - Exporting'!F20=0,\"\",'Part C - Exporting'!F20)","v":""},{"$f":"IF('Part C - Exporting'!G20=0,\"\",'Part C - Exporting'!G20)","v":""},null,{"$f":"IF('Part C - Exporting'!I20=0,\"\",'Part C - Exporting'!I20)","v":""},{"$f":"IF('Part C - Exporting'!J20=0,\"\",'Part C - Exporting'!J20)","v":""},{"$f":"IF('Part C - Exporting'!K20=0,\"\",'Part C - Exporting'!K20)","v":""},{"$f":"IF('Part C - Exporting'!L20=0,\"\",'Part C - Exporting'!L20)","v":""},{"$f":"IF('Part C - Exporting'!M20=0,\"\",'Part C - Exporting'!M20)","v":""}]
["xi",{"$f":"IF('Part C - Exporting'!B21=0,\"\",'Part C - Exporting'!B21)","v":""},{"$f":"IF('Part C - Exporting'!C21=0,\"\",'Part C - Exporting'!C21)","v":""},{"$f":"IF('Part C - Exporting'!D21=0,\"\",'Part C - Exporting'!D21)","v":""},null,{"$f":"IF('Part C - Exporting'!F21=0,\"\",'Part C - Exporting'!F21)","v":""},{"$f":"IF('Part C - Exporting'!G21=0,\"\",'Part C - Exporting'!G21)","v":""},null,{"$f":"IF('Part C - Exporting'!I21=0,\"\",'Part C - Exporting'!I21)","v":""},{"$f":"IF('Part C - Exporting'!J21=0,\"\",'Part C - Exporting'!J21)","v":""},{"$f":"IF('Part C - Exporting'!K21=0,\"\",'Part C - Exporting'!K21)","v":""},{"$f":"IF('Part C - Exporting'!L21=0,\"\",'Part C - Exporting'!L21)","v":""},{"$f":"IF('Part C - Exporting'!M21=0,\"\",'Part C - Exporting'!M21)","v":""}]
["xii",{"$f":"IF('Part C - Exporting'!B22=0,\"\",'Part C - Exporting'!B22)","v":""},{"$f":"IF('Part C - Exporting'!C22=0,\"\",'Part C - Exporting'!C22)","v":""},{"$f":"IF('Part C - Exporting'!D22=0,\"\",'Part C - Exporting'!D22)","v":""},null,{"$f":"IF('Part C - Exporting'!F22=0,\"\",'Part C - Exporting'!F22)","v":""},{"$f":"IF('Part C - Exporting'!G22=0,\"\",'Part C - Exporting'!G22)","v":""},null,{"$f":"IF('Part C - Exporting'!I22=0,\"\",'Part C - Exporting'!I22)","v":""},{"$f":"IF('Part C - Exporting'!J22=0,\"\",'Part C - Exporting'!J22)","v":""},{"$f":"IF('Part C - Exporting'!K22=0,\"\",'Part C - Exporting'!K22)","v":""},{"$f":"IF('Part C - Exporting'!L22=0,\"\",'Part C - Exporting'!L22)","v":""},{"$f":"IF('Part C - Exporting'!M22=0,\"\",'Part C - Exporting'!M22)","v":""}]
["xiii",{"$f":"IF('Part C - Exporting'!B23=0,\"\",'Part C - Exporting'!B23)","v":""},{"$f":"IF('Part C - Exporting'!C23=0,\"\",'Part C - Exporting'!C23)","v":""},{"$f":"IF('Part C - Exporting'!D23=0,\"\",'Part C - Exporting'!D23)","v":""},null,{"$f":"IF('Part C - Exporting'!F23=0,\"\",'Part C - Exporting'!F23)","v":""},{"$f":"IF('Part C - Exporting'!G23=0,\"\",'Part C - Exporting'!G23)","v":""},null,{"$f":"IF('Part C - Exporting'!I23=0,\"\",'Part C - Exporting'!I23)","v":""},{"$f":"IF('Part C - Exporting'!J23=0,\"\",'Part C - Exporting'!J23)","v":""},{"$f":"IF('Part C - Exporting'!K23=0,\"\",'Part C - Exporting'!K23)","v":""},{"$f":"IF('Part C - Exporting'!L23=0,\"\",'Part C - Exporting'!L23)","v":""},{"$f":"IF('Part C - Exporting'!M23=0,\"\",'Part C - Exporting'!M23)","v":""}]
["xiv",{"$f":"IF('Part C - Exporting'!B24=0,\"\",'Part C - Exporting'!B24)","v":""},{"$f":"IF('Part C - Exporting'!C24=0,\"\",'Part C - Exporting'!C24)","v":""},{"$f":"IF('Part C - Exporting'!D24=0,\"\",'Part C - Exporting'!D24)","v":""},null,{"$f":"IF('Part C - Exporting'!F24=0,\"\",'Part C - Exporting'!F24)","v":""},{"$f":"IF('Part C - Exporting'!G24=0,\"\",'Part C - Exporting'!G24)","v":""},null,{"$f":"IF('Part C - Exporting'!I24=0,\"\",'Part C - Exporting'!I24)","v":""},{"$f":"IF('Part C - Exporting'!J24=0,\"\",'Part C - Exporting'!J24)","v":""},{"$f":"IF('Part C - Exporting'!K24=0,\"\",'Part C - Exporting'!K24)","v":""},{"$f":"IF('Part C - Exporting'!L24=0,\"\",'Part C - Exporting'!L24)","v":""},{"$f":"IF('Part C - Exporting'!M24=0,\"\",'Part C - Exporting'!M24)","v":""}]
["xv",{"$f":"IF('Part C - Exporting'!B25=0,\"\",'Part C - Exporting'!B25)","v":""},{"$f":"IF('Part C - Exporting'!C25=0,\"\",'Part C - Exporting'!C25)","v":""},{"$f":"IF('Part C - Exporting'!D25=0,\"\",'Part C - Exporting'!D25)","v":""},null,{"$f":"IF('Part C - Exporting'!F25=0,\"\",'Part C - Exporting'!F25)","v":""},{"$f":"IF('Part C - Exporting'!G25=0,\"\",'Part C - Exporting'!G25)","v":""},null,{"$f":"IF('Part C - Exporting'!I25=0,\"\",'Part C - Exporting'!I25)","v":""},{"$f":"IF('Part C - Exporting'!J25=0,\"\",'Part C - Exporting'!J25)","v":""},{"$f":"IF('Part C - Exporting'!K25=0,\"\",'Part C - Exporting'!K25)","v":""},{"$f":"IF('Part C - Exporting'!L25=0,\"\",'Part C - Exporting'!L25)","v":""},{"$f":"IF('Part C - Exporting'!M25=0,\"\",'Part C - Exporting'!M25)","v":""}]
["xvi",{"$f":"IF('Part C - Exporting'!B26=0,\"\",'Part C - Exporting'!B26)","v":""},{"$f":"IF('Part C - Exporting'!C26=0,\"\",'Part C - Exporting'!C26)","v":""},{"$f":"IF('Part C - Exporting'!D26=0,\"\",'Part C - Exporting'!D26)","v":""},null,{"$f":"IF('Part C - Exporting'!F26=0,\"\",'Part C - Exporting'!F26)","v":""},{"$f":"IF('Part C - Exporting'!G26=0,\"\",'Part C - Exporting'!G26)","v":""},null,{"$f":"IF('Part C - Exporting'!I26=0,\"\",'Part C - Exporting'!I26)","v":""},{"$f":"IF('Part C - Exporting'!J26=0,\"\",'Part C - Exporting'!J26)","v":""},{"$f":"IF('Part C - Exporting'!K26=0,\"\",'Part C - Exporting'!K26)","v":""},{"$f":"IF('Part C - Exporting'!L26=0,\"\",'Part C - Exporting'!L26)","v":""},{"$f":"IF('Part C - Exporting'!M26=0,\"\",'Part C - Exporting'!M26)","v":""}]
["xvii",{"$f":"IF('Part C - Exporting'!B27=0,\"\",'Part C - Exporting'!B27)","v":""},{"$f":"IF('Part C - Exporting'!C27=0,\"\",'Part C - Exporting'!C27)","v":""},{"$f":"IF('Part C - Exporting'!D27=0,\"\",'Part C - Exporting'!D27)","v":""},null,{"$f":"IF('Part C - Exporting'!F27=0,\"\",'Part C - Exporting'!F27)","v":""},{"$f":"IF('Part C - Exporting'!G27=0,\"\",'Part C - Exporting'!G27)","v":""},null,{"$f":"IF('Part C - Exporting'!I27=0,\"\",'Part C - Exporting'!I27)","v":""},{"$f":"IF('Part C - Exporting'!J27=0,\"\",'Part C - Exporting'!J27)","v":""},{"$f":"IF('Part C - Exporting'!K27=0,\"\",'Part C - Exporting'!K27)","v":""},{"$f":"IF('Part C - Exporting'!L27=0,\"\",'Part C - Exporting'!L27)","v":""},{"$f":"IF('Part C - Exporting'!M27=0,\"\",'Part C - Exporting'!M27)","v":""}]
["xviii",{"$f":"IF('Part C - Exporting'!B28=0,\"\",'Part C - Exporting'!B28)","v":""},{"$f":"IF('Part C - Exporting'!C28=0,\"\",'Part C - Exporting'!C28)","v":""},{"$f":"IF('Part C - Exporting'!D28=0,\"\",'Part C - Exporting'!D28)","v":""},null,{"$f":"IF('Part C - Exporting'!F28=0,\"\",'Part C - Exporting'!F28)","v":""},{"$f":"IF('Part C - Exporting'!G28=0,\"\",'Part C - Exporting'!G28)","v":""},null,{"$f":"IF('Part C - Exporting'!I28=0,\"\",'Part C - Exporting'!I28)","v":""},{"$f":"IF('Part C - Exporting'!J28=0,\"\",'Part C - Exporting'!J28)","v":""},{"$f":"IF('Part C - Exporting'!K28=0,\"\",'Part C - Exporting'!K28)","v":""},{"$f":"IF('Part C - Exporting'!L28=0,\"\",'Part C - Exporting'!L28)","v":""},{"$f":"IF('Part C - Exporting'!M28=0,\"\",'Part C - Exporting'!M28)","v":""}]
["xix",{"$f":"IF('Part C - Exporting'!B29=0,\"\",'Part C - Exporting'!B29)","v":""},{"$f":"IF('Part C - Exporting'!C29=0,\"\",'Part C - Exporting'!C29)","v":""},{"$f":"IF('Part C - Exporting'!D29=0,\"\",'Part C - Exporting'!D29)","v":""},null,{"$f":"IF('Part C - Exporting'!F29=0,\"\",'Part C - Exporting'!F29)","v":""},{"$f":"IF('Part C - Exporting'!G29=0,\"\",'Part C - Exporting'!G29)","v":""},null,{"$f":"IF('Part C - Exporting'!I29=0,\"\",'Part C - Exporting'!I29)","v":""},{"$f":"IF('Part C - Exporting'!J29=0,\"\",'Part C - Exporting'!J29)","v":""},{"$f":"IF('Part C - Exporting'!K29=0,\"\",'Part C - Exporting'!K29)","v":""},{"$f":"IF('Part C - Exporting'!L29=0,\"\",'Part C - Exporting'!L29)","v":""},{"$f":"IF('Part C - Exporting'!M29=0,\"\",'Part C - Exporting'!M29)","v":""}]
["xx",{"$f":"IF('Part C - Exporting'!B30=0,\"\",'Part C - Exporting'!B30)","v":""},{"$f":"IF('Part C - Exporting'!C30=0,\"\",'Part C - Exporting'!C30)","v":""},{"$f":"IF('Part C - Exporting'!D30=0,\"\",'Part C - Exporting'!D30)","v":""},null,{"$f":"IF('Part C - Exporting'!F30=0,\"\",'Part C - Exporting'!F30)","v":""},{"$f":"IF('Part C - Exporting'!G30=0,\"\",'Part C - Exporting'!G30)","v":""},null,{"$f":"IF('Part C - Exporting'!I30=0,\"\",'Part C - Exporting'!I30)","v":""},{"$f":"IF('Part C - Exporting'!J30=0,\"\",'Part C - Exporting'!J30)","v":""},{"$f":"IF('Part C - Exporting'!K30=0,\"\",'Part C - Exporting'!K30)","v":""},{"$f":"IF('Part C - Exporting'!L30=0,\"\",'Part C - Exporting'!L30)","v":""},{"$f":"IF('Part C - Exporting'!M30=0,\"\",'Part C - Exporting'!M30)","v":""}]
[]
["表C2.措施指标（验证措施对控制点的影响的能力、生产者可接受度、行业可接受度、社会可接受度）"]
[null,{"$f":"B8","v":"可用的系统方法措施（来自B部分）"},"验证措施对控制点的影响的能力",null,null,"生产者可接受度",null,null,"行业可接受度",null,null,"社会可接受度 "]
[null,null,"使用控制点调整系统的能力是：",null,null,"生产者可接受度是： ",null,null,"行业可接受度是：",null,null,"社会可接受度是："]
[null,null,"评分","不确定性","说明","评分","不确定性","说明","评分","不确定性","说明","评分","不确定性","说明"]
["i",{"$f":"IF('Part C - Exporting'!B36=0,\"\",'Part C - Exporting'!B36)","v":""},{"$f":"IF('Part C - Exporting'!C36=0,\"\",'Part C - Exporting'!C36)","v":""},{"$f":"IF('Part C - Exporting'!D36=0,\"\",'Part C - Exporting'!D36)","v":""},null,{"$f":"IF('Part C - Exporting'!F36=0,\"\",'Part C - Exporting'!F36)","v":""},{"$f":"IF('Part C - Exporting'!G36=0,\"\",'Part C - Exporting'!G36)","v":""},null,{"$f":"IF('Part C - Exporting'!I36=0,\"\",'Part C - Exporting'!I36)","v":""},{"$f":"IF('Part C - Exporting'!J36=0,\"\",'Part C - Exporting'!J36)","v":""},null,{"$f":"IF('Part C - Exporting'!L36=0,\"\",'Part C - Exporting'!L36)","v":""},{"$f":"IF('Part C - Exporting'!M36=0,\"\",'Part C - Exporting'!M36)","v":""}]
["ii",{"$f":"IF('Part C - Exporting'!B37=0,\"\",'Part C - Exporting'!B37)","v":""},{"$f":"IF('Part C - Exporting'!C37=0,\"\",'Part C - Exporting'!C37)","v":""},{"$f":"IF('Part C - Exporting'!D37=0,\"\",'Part C - Exporting'!D37)","v":""},null,{"$f":"IF('Part C - Exporting'!F37=0,\"\",'Part C - Exporting'!F37)","v":""},{"$f":"IF('Part C - Exporting'!G37=0,\"\",'Part C - Exporting'!G37)","v":""},null,{"$f":"IF('Part C - Exporting'!I37=0,\"\",'Part C - Exporting'!I37)","v":""},{"$f":"IF('Part C - Exporting'!J37=0,\"\",'Part C - Exporting'!J37)","v":""},null,{"$f":"IF('Part C - Exporting'!L37=0,\"\",'Part C - Exporting'!L37)","v":""},{"$f":"IF('Part C - Exporting'!M37=0,\"\",'Part C - Exporting'!M37)","v":""}]
["iii",{"$f":"IF('Part C - Exporting'!B38=0,\"\",'Part C - Exporting'!B38)","v":""},{"$f":"IF('Part C - Exporting'!C38=0,\"\",'Part C - Exporting'!C38)","v":""},{"$f":"IF('Part C - Exporting'!D38=0,\"\",'Part C - Exporting'!D38)","v":""},null,{"$f":"IF('Part C - Exporting'!F38=0,\"\",'Part C - Exporting'!F38)","v":""},{"$f":"IF('Part C - Exporting'!G38=0,\"\",'Part C - Exporting'!G38)","v":""},null,{"$f":"IF('Part C - Exporting'!I38=0,\"\",'Part C - Exporting'!I38)","v":""},{"$f":"IF('Part C - Exporting'!J38=0,\"\",'Part C - Exporting'!J38)","v":""},null,{"$f":"IF('Part C - Exporting'!L38=0,\"\",'Part C - Exporting'!L38)","v":""},{"$f":"IF('Part C - Exporting'!M38=0,\"\",'Part C - Exporting'!M38)","v":""}]
["iv",{"$f":"IF('Part C - Exporting'!B39=0,\"\",'Part C - Exporting'!B39)","v":""},{"$f":"IF('Part C - Exporting'!C39=0,\"\",'Part C - Exporting'!C39)","v":""},{"$f":"IF('Part C - Exporting'!D39=0,\"\",'Part C - Exporting'!D39)","v":""},null,{"$f":"IF('Part C - Exporting'!F39=0,\"\",'Part C - Exporting'!F39)","v":""},{"$f":"IF('Part C - Exporting'!G39=0,\"\",'Part C - Exporting'!G39)","v":""},null,{"$f":"IF('Part C - Exporting'!I39=0,\"\",'Part C - Exporting'!I39)","v":""},{"$f":"IF('Part C - Exporting'!J39=0,\"\",'Part C - Exporting'!J39)","v":""},null,{"$f":"IF('Part C - Exporting'!L39=0,\"\",'Part C - Exporting'!L39)","v":""},{"$f":"IF('Part C - Exporting'!M39=0,\"\",'Part C - Exporting'!M39)","v":""}]
["v",{"$f":"IF('Part C - Exporting'!B40=0,\"\",'Part C - Exporting'!B40)","v":""},{"$f":"IF('Part C - Exporting'!C40=0,\"\",'Part C - Exporting'!C40)","v":""},{"$f":"IF('Part C - Exporting'!D40=0,\"\",'Part C - Exporting'!D40)","v":""},null,{"$f":"IF('Part C - Exporting'!F40=0,\"\",'Part C - Exporting'!F40)","v":""},{"$f":"IF('Part C - Exporting'!G40=0,\"\",'Part C - Exporting'!G40)","v":""},null,{"$f":"IF('Part C - Exporting'!I40=0,\"\",'Part C - Exporting'!I40)","v":""},{"$f":"IF('Part C - Exporting'!J40=0,\"\",'Part C - Exporting'!J40)","v":""},null,{"$f":"IF('Part C - Exporting'!L40=0,\"\",'Part C - Exporting'!L40)","v":""},{"$f":"IF('Part C - Exporting'!M40=0,\"\",'Part C - Exporting'!M40)","v":""}]
["vi",{"$f":"IF('Part C - Exporting'!B41=0,\"\",'Part C - Exporting'!B41)","v":""},{"$f":"IF('Part C - Exporting'!C41=0,\"\",'Part C - Exporting'!C41)","v":""},{"$f":"IF('Part C - Exporting'!D41=0,\"\",'Part C - Exporting'!D41)","v":""},null,{"$f":"IF('Part C - Exporting'!F41=0,\"\",'Part C - Exporting'!F41)","v":""},{"$f":"IF('Part C - Exporting'!G41=0,\"\",'Part C - Exporting'!G41)","v":""},null,{"$f":"IF('Part C - Exporting'!I41=0,\"\",'Part C - Exporting'!I41)","v":""},{"$f":"IF('Part C - Exporting'!J41=0,\"\",'Part C - Exporting'!J41)","v":""},null,{"$f":"IF('Part C - Exporting'!L41=0,\"\",'Part C - Exporting'!L41)","v":""},{"$f":"IF('Part C - Exporting'!M41=0,\"\",'Part C - Exporting'!M41)","v":""}]
["vii",{"$f":"IF('Part C - Exporting'!B42=0,\"\",'Part C - Exporting'!B42)","v":""},{"$f":"IF('Part C - Exporting'!C42=0,\"\",'Part C - Exporting'!C42)","v":""},{"$f":"IF('Part C - Exporting'!D42=0,\"\",'Part C - Exporting'!D42)","v":""},null,{"$f":"IF('Part C - Exporting'!F42=0,\"\",'Part C - Exporting'!F42)","v":""},{"$f":"IF('Part C - Exporting'!G42=0,\"\",'Part C - Exporting'!G42)","v":""},null,{"$f":"IF('Part C - Exporting'!I42=0,\"\",'Part C - Exporting'!I42)","v":""},{"$f":"IF('Part C - Exporting'!J42=0,\"\",'Part C - Exporting'!J42)","v":""},null,{"$f":"IF('Part C - Exporting'!L42=0,\"\",'Part C - Exporting'!L42)","v":""},{"$f":"IF('Part C - Exporting'!M42=0,\"\",'Part C - Exporting'!M42)","v":""}]
["viii",{"$f":"IF('Part C - Exporting'!B43=0,\"\",'Part C - Exporting'!B43)","v":""},{"$f":"IF('Part C - Exporting'!C43=0,\"\",'Part C - Exporting'!C43)","v":""},{"$f":"IF('Part C - Exporting'!D43=0,\"\",'Part C - Exporting'!D43)","v":""},null,{"$f":"IF('Part C - Exporting'!F43=0,\"\",'Part C - Exporting'!F43)","v":""},{"$f":"IF('Part C - Exporting'!G43=0,\"\",'Part C - Exporting'!G43)","v":""},null,{"$f":"IF('Part C - Exporting'!I43=0,\"\",'Part C - Exporting'!I43)","v":""},{"$f":"IF('Part C - Exporting'!J43=0,\"\",'Part C - Exporting'!J43)","v":""},null,{"$f":"IF('Part C - Exporting'!L43=0,\"\",'Part C - Exporting'!L43)","v":""},{"$f":"IF('Part C - Exporting'!M43=0,\"\",'Part C - Exporting'!M43)","v":""}]
["ix",{"$f":"IF('Part C - Exporting'!B44=0,\"\",'Part C - Exporting'!B44)","v":""},{"$f":"IF('Part C - Exporting'!C44=0,\"\",'Part C - Exporting'!C44)","v":""},{"$f":"IF('Part C - Exporting'!D44=0,\"\",'Part C - Exporting'!D44)","v":""},null,{"$f":"IF('Part C - Exporting'!F44=0,\"\",'Part C - Exporting'!F44)","v":""},{"$f":"IF('Part C - Exporting'!G44=0,\"\",'Part C - Exporting'!G44)","v":""},null,{"$f":"IF('Part C - Exporting'!I44=0,\"\",'Part C - Exporting'!I44)","v":""},{"$f":"IF('Part C - Exporting'!J44=0,\"\",'Part C - Exporting'!J44)","v":""},null,{"$f":"IF('Part C - Exporting'!L44=0,\"\",'Part C - Exporting'!L44)","v":""},{"$f":"IF('Part C - Exporting'!M44=0,\"\",'Part C - Exporting'!M44)","v":""}]
["x",{"$f":"IF('Part C - Exporting'!B45=0,\"\",'Part C - Exporting'!B45)","v":""},{"$f":"IF('Part C - Exporting'!C45=0,\"\",'Part C - Exporting'!C45)","v":""},{"$f":"IF('Part C - Exporting'!D45=0,\"\",'Part C - Exporting'!D45)","v":""},null,{"$f":"IF('Part C - Exporting'!F45=0,\"\",'Part C - Exporting'!F45)","v":""},{"$f":"IF('Part C - Exporting'!G45=0,\"\",'Part C - Exporting'!G45)","v":""},null,{"$f":"IF('Part C - Exporting'!I45=0,\"\",'Part C - Exporting'!I45)","v":""},{"$f":"IF('Part C - Exporting'!J45=0,\"\",'Part C - Exporting'!J45)","v":""},null,{"$f":"IF('Part C - Exporting'!L45=0,\"\",'Part C - Exporting'!L45)","v":""},{"$f":"IF('Part C - Exporting'!M45=0,\"\",'Part C - Exporting'!M45)","v":""}]
["xi",{"$f":"IF('Part C - Exporting'!B46=0,\"\",'Part C - Exporting'!B46)","v":""},{"$f":"IF('Part C - Exporting'!C46=0,\"\",'Part C - Exporting'!C46)","v":""},{"$f":"IF('Part C - Exporting'!D46=0,\"\",'Part C - Exporting'!D46)","v":""},null,{"$f":"IF('Part C - Exporting'!F46=0,\"\",'Part C - Exporting'!F46)","v":""},{"$f":"IF('Part C - Exporting'!G46=0,\"\",'Part C - Exporting'!G46)","v":""},null,{"$f":"IF('Part C - Exporting'!I46=0,\"\",'Part C - Exporting'!I46)","v":""},{"$f":"IF('Part C - Exporting'!J46=0,\"\",'Part C - Exporting'!J46)","v":""},null,{"$f":"IF('Part C - Exporting'!L46=0,\"\",'Part C - Exporting'!L46)","v":""},{"$f":"IF('Part C - Exporting'!M46=0,\"\",'Part C - Exporting'!M46)","v":""}]
["xii",{"$f":"IF('Part C - Exporting'!B47=0,\"\",'Part C - Exporting'!B47)","v":""},{"$f":"IF('Part C - Exporting'!C47=0,\"\",'Part C - Exporting'!C47)","v":""},{"$f":"IF('Part C - Exporting'!D47=0,\"\",'Part C - Exporting'!D47)","v":""},null,{"$f":"IF('Part C - Exporting'!F47=0,\"\",'Part C - Exporting'!F47)","v":""},{"$f":"IF('Part C - Exporting'!G47=0,\"\",'Part C - Exporting'!G47)","v":""},null,{"$f":"IF('Part C - Exporting'!I47=0,\"\",'Part C - Exporting'!I47)","v":""},{"$f":"IF('Part C - Exporting'!J47=0,\"\",'Part C - Exporting'!J47)","v":""},null,{"$f":"IF('Part C - Exporting'!L47=0,\"\",'Part C - Exporting'!L47)","v":""},{"$f":"IF('Part C - Exporting'!M47=0,\"\",'Part C - Exporting'!M47)","v":""}]
["xiii",{"$f":"IF('Part C - Exporting'!B48=0,\"\",'Part C - Exporting'!B48)","v":""},{"$f":"IF('Part C - Exporting'!C48=0,\"\",'Part C - Exporting'!C48)","v":""},{"$f":"IF('Part C - Exporting'!D48=0,\"\",'Part C - Exporting'!D48)","v":""},null,{"$f":"IF('Part C - Exporting'!F48=0,\"\",'Part C - Exporting'!F48)","v":""},{"$f":"IF('Part C - Exporting'!G48=0,\"\",'Part C - Exporting'!G48)","v":""},null,{"$f":"IF('Part C - Exporting'!I48=0,\"\",'Part C - Exporting'!I48)","v":""},{"$f":"IF('Part C - Exporting'!J48=0,\"\",'Part C - Exporting'!J48)","v":""},null,{"$f":"IF('Part C - Exporting'!L48=0,\"\",'Part C - Exporting'!L48)","v":""},{"$f":"IF('Part C - Exporting'!M48=0,\"\",'Part C - Exporting'!M48)","v":""}]
["xiv",{"$f":"IF('Part C - Exporting'!B49=0,\"\",'Part C - Exporting'!B49)","v":""},{"$f":"IF('Part C - Exporting'!C49=0,\"\",'Part C - Exporting'!C49)","v":""},{"$f":"IF('Part C - Exporting'!D49=0,\"\",'Part C - Exporting'!D49)","v":""},null,{"$f":"IF('Part C - Exporting'!F49=0,\"\",'Part C - Exporting'!F49)","v":""},{"$f":"IF('Part C - Exporting'!G49=0,\"\",'Part C - Exporting'!G49)","v":""},null,{"$f":"IF('Part C - Exporting'!I49=0,\"\",'Part C - Exporting'!I49)","v":""},{"$f":"IF('Part C - Exporting'!J49=0,\"\",'Part C - Exporting'!J49)","v":""},null,{"$f":"IF('Part C - Exporting'!L49=0,\"\",'Part C - Exporting'!L49)","v":""},{"$f":"IF('Part C - Exporting'!M49=0,\"\",'Part C - Exporting'!M49)","v":""}]
["xv",{"$f":"IF('Part C - Exporting'!B50=0,\"\",'Part C - Exporting'!B50)","v":""},{"$f":"IF('Part C - Exporting'!C50=0,\"\",'Part C - Exporting'!C50)","v":""},{"$f":"IF('Part C - Exporting'!D50=0,\"\",'Part C - Exporting'!D50)","v":""},null,{"$f":"IF('Part C - Exporting'!F50=0,\"\",'Part C - Exporting'!F50)","v":""},{"$f":"IF('Part C - Exporting'!G50=0,\"\",'Part C - Exporting'!G50)","v":""},null,{"$f":"IF('Part C - Exporting'!I50=0,\"\",'Part C - Exporting'!I50)","v":""},{"$f":"IF('Part C - Exporting'!J50=0,\"\",'Part C - Exporting'!J50)","v":""},null,{"$f":"IF('Part C - Exporting'!L50=0,\"\",'Part C - Exporting'!L50)","v":""},{"$f":"IF('Part C - Exporting'!M50=0,\"\",'Part C - Exporting'!M50)","v":""}]
["xvi",{"$f":"IF('Part C - Exporting'!B51=0,\"\",'Part C - Exporting'!B51)","v":""},{"$f":"IF('Part C - Exporting'!C51=0,\"\",'Part C - Exporting'!C51)","v":""},{"$f":"IF('Part C - Exporting'!D51=0,\"\",'Part C - Exporting'!D51)","v":""},null,{"$f":"IF('Part C - Exporting'!F51=0,\"\",'Part C - Exporting'!F51)","v":""},{"$f":"IF('Part C - Exporting'!G51=0,\"\",'Part C - Exporting'!G51)","v":""},null,{"$f":"IF('Part C - Exporting'!I51=0,\"\",'Part C - Exporting'!I51)","v":""},{"$f":"IF('Part C - Exporting'!J51=0,\"\",'Part C - Exporting'!J51)","v":""},null,{"$f":"IF('Part C - Exporting'!L51=0,\"\",'Part C - Exporting'!L51)","v":""},{"$f":"IF('Part C - Exporting'!M51=0,\"\",'Part C - Exporting'!M51)","v":""}]
["xvii",{"$f":"IF('Part C - Exporting'!B52=0,\"\",'Part C - Exporting'!B52)","v":""},{"$f":"IF('Part C - Exporting'!C52=0,\"\",'Part C - Exporting'!C52)","v":""},{"$f":"IF('Part C - Exporting'!D52=0,\"\",'Part C - Exporting'!D52)","v":""},null,{"$f":"IF('Part C - Exporting'!F52=0,\"\",'Part C - Exporting'!F52)","v":""},{"$f":"IF('Part C - Exporting'!G52=0,\"\",'Part C - Exporting'!G52)","v":""},null,{"$f":"IF('Part C - Exporting'!I52=0,\"\",'Part C - Exporting'!I52)","v":""},{"$f":"IF('Part C - Exporting'!J52=0,\"\",'Part C - Exporting'!J52)","v":""},null,{"$f":"IF('Part C - Exporting'!L52=0,\"\",'Part C - Exporting'!L52)","v":""},{"$f":"IF('Part C - Exporting'!M52=0,\"\",'Part C - Exporting'!M52)","v":""}]
["xviii",{"$f":"IF('Part C - Exporting'!B53=0,\"\",'Part C - Exporting'!B53)","v":""},{"$f":"IF('Part C - Exporting'!C53=0,\"\",'Part C - Exporting'!C53)","v":""},{"$f":"IF('Part C - Exporting'!D53=0,\"\",'Part C - Exporting'!D53)","v":""},null,{"$f":"IF('Part C - Exporting'!F53=0,\"\",'Part C - Exporting'!F53)","v":""},{"$f":"IF('Part C - Exporting'!G53=0,\"\",'Part C - Exporting'!G53)","v":""},null,{"$f":"IF('Part C - Exporting'!I53=0,\"\",'Part C - Exporting'!I53)","v":""},{"$f":"IF('Part C - Exporting'!J53=0,\"\",'Part C - Exporting'!J53)","v":""},null,{"$f":"IF('Part C - Exporting'!L53=0,\"\",'Part C - Exporting'!L53)","v":""},{"$f":"IF('Part C - Exporting'!M53=0,\"\",'Part C - Exporting'!M53)","v":""}]
["xix",{"$f":"IF('Part C - Exporting'!B54=0,\"\",'Part C - Exporting'!B54)","v":""},{"$f":"IF('Part C - Exporting'!C54=0,\"\",'Part C - Exporting'!C54)","v":""},{"$f":"IF('Part C - Exporting'!D54=0,\"\",'Part C - Exporting'!D54)","v":""},null,{"$f":"IF('Part C - Exporting'!F54=0,\"\",'Part C - Exporting'!F54)","v":""},{"$f":"IF('Part C - Exporting'!G54=0,\"\",'Part C - Exporting'!G54)","v":""},null,{"$f":"IF('Part C - Exporting'!I54=0,\"\",'Part C - Exporting'!I54)","v":""},{"$f":"IF('Part C - Exporting'!J54=0,\"\",'Part C - Exporting'!J54)","v":""},null,{"$f":"IF('Part C - Exporting'!L54=0,\"\",'Part C - Exporting'!L54)","v":""},{"$f":"IF('Part C - Exporting'!M54=0,\"\",'Part C - Exporting'!M54)","v":""}]
["xx",{"$f":"IF('Part C - Exporting'!B55=0,\"\",'Part C - Exporting'!B55)","v":""},{"$f":"IF('Part C - Exporting'!C55=0,\"\",'Part C - Exporting'!C55)","v":""},{"$f":"IF('Part C - Exporting'!D55=0,\"\",'Part C - Exporting'!D55)","v":""},null,{"$f":"IF('Part C - Exporting'!F55=0,\"\",'Part C - Exporting'!F55)","v":""},{"$f":"IF('Part C - Exporting'!G55=0,\"\",'Part C - Exporting'!G55)","v":""},null,{"$f":"IF('Part C - Exporting'!I55=0,\"\",'Part C - Exporting'!I55)","v":""},{"$f":"IF('Part C - Exporting'!J55=0,\"\",'Part C - Exporting'!J55)","v":""},null,{"$f":"IF('Part C - Exporting'!L55=0,\"\",'Part C - Exporting'!L55)","v":""},{"$f":"IF('Part C - Exporting'!M55=0,\"\",'Part C - Exporting'!M55)","v":""}]
[]
[]
[]
[]
[]
[]
[]
[]
[{"$f":"'Part C - Exporting'!A64","v":"表C3：整合系统方法措施"}]
[null,"拟议的系统方法包的参考名称"," 措施1"," 措施2"," 措施3"," 措施4"," 措施5"," 措施6"," 措施7"," 措施8"," 措施9"," 措施10"," 措施11"," 措施12"," 措施13"," 措施14"," 措施15"," 措施16"," 措施17"," 措施18"," 措施19"," 措施20"]
[null,"系统方法",{"$f":"IF('Part C - Exporting'!D66=0,\"\",'Part C - Exporting'!D66)","v":""},{"$f":"IF('Part C - Exporting'!E66=0,\"\",'Part C - Exporting'!E66)","v":""},{"$f":"IF('Part C - Exporting'!F66=0,\"\",'Part C - Exporting'!F66)","v":""},{"$f":"IF('Part C - Exporting'!G66=0,\"\",'Part C - Exporting'!G66)","v":""},{"$f":"IF('Part C - Exporting'!H66=0,\"\",'Part C - Exporting'!H66)","v":""},{"$f":"IF('Part C - Exporting'!I66=0,\"\",'Part C - Exporting'!I66)","v":""},{"$f":"IF('Part C - Exporting'!J66=0,\"\",'Part C - Exporting'!J66)","v":""},{"$f":"IF('Part C - Exporting'!K66=0,\"\",'Part C - Exporting'!K66)","v":""},{"$f":"IF('Part C - Exporting'!L66=0,\"\",'Part C - Exporting'!L66)","v":""},{"$f":"IF('Part C - Exporting'!M66=0,\"\",'Part C - Exporting'!M66)","v":""},{"$f":"IF('Part C - Exporting'!N66=0,\"\",'Part C - Exporting'!N66)","v":""},{"$f":"IF('Part C - Exporting'!O66=0,\"\",'Part C - Exporting'!O66)","v":""},{"$f":"IF('Part C - Exporting'!P66=0,\"\",'Part C - Exporting'!P66)","v":""},{"$f":"IF('Part C - Exporting'!Q66=0,\"\",'Part C - Exporting'!Q66)","v":""},{"$f":"IF('Part C - Exporting'!R66=0,\"\",'Part C - Exporting'!R66)","v":""},{"$f":"IF('Part C - Exporting'!S66=0,\"\",'Part C - Exporting'!S66)","v":""},{"$f":"IF('Part C - Exporting'!T66=0,\"\",'Part C - Exporting'!T66)","v":""},{"$f":"IF('Part C - Exporting'!U66=0,\"\",'Part C - Exporting'!U66)","v":""},{"$f":"IF('Part C - Exporting'!V66=0,\"\",'Part C - Exporting'!V66)","v":""},{"$f":"IF('Part C - Exporting'!W66=0,\"\",'Part C - Exporting'!W66)","v":""}]
[]
[]
[]
[]
[{"$f":"'Part C - Exporting'!A82","v":"表C4：系统方法的总体预期绩效"}]
[null,"系统方法包","对系统方法的预期整体绩效进行评分",null,null,"其他说明"]
[null,null,"评分","不确定性","说明","验证措施的方法"]
[null,{"$f":"IF(B66=0,\"\",B66)","v":"系统方法"},{"$f":"IF('Part C - Exporting'!C85=0,\"\",'Part C - Exporting'!C85)","v":""},{"$f":"IF('Part C - Exporting'!D85=0,\"\",'Part C - Exporting'!D85)","v":""},null,{"$f":"IF('Part C - Exporting'!F85=0,\"\",'Part C - Exporting'!F85)","v":""},{"$f":"IF('Part C - Exporting'!G85=0,\"\",'Part C - Exporting'!G85)","v":""}]

{"sheet":"Part C - Add Coms Importing","index":8,"n_rows":74,"n_cols":22,"rows_kept":74,"cut":false,"hidden":true,"merged":[[2,9,2,10],[6,0,6,7],[6,8,6,12],[7,2,7,4],[7,5,7,7],[8,2,8,4],[8,5,8,7],[10,8,10,9],[10,10,10,11],[11,8,11,9],[11,10,11,11],[12,8,12,9],[12,10,12,11],[13,8,13,9],[13,10,13,11],[14,8,14,9],[14,10,14,11],[15,8,15,9],[15,10,15,11],[16,8,16,9],[16,10,16,11],[17,8,17,9],[17,10,17,11],[18,8,18,9],[18,10,18,11],[19,8,19,9],[19,10,19,11],[20,8,20,9],[20,10,20,11],[21,8,21,9],[21,10,21,11],[22,8,22,9],[22,10,22,11],[23,8,23,9],[23,10,23,11],[24,8,24,9],[24,10,24,11],[25,8,25,9],[25,10,25,11],[26,8,26,9],[26,10,26,11],[27,8,27,9],[27,10,27,11],[28,8,28,9],[28,10,28,11],[29,8,29,9],[29,10,29,11],[31,0,31,13],[32,2,32,4],[32,5,32,7],[32,8,32,10],[32,11,32,13],[33,2,33,4],[33,5,33,7],[33,8,33,10],[33,11,33,13],[63,0,63,21],[70,0,70,6],[71,2,71,4],[73,5,73,6],[7,0,9,0],[32,0,33,0],[7,1,9,1],[32,1,33,1],[7,12,9,12],[71,5,72,6],[7,8,9,9],[7,10,9,11]]}
[null,{"$f":"Main!B1","v":"全球超越合规 — 系统方法决策支持（DSSA）"}]
[null,{"$f":"IF(OR(ISBLANK('Part A - Importing'!D7),ISBLANK('Part A - Importing'!D9),ISBLANK('Part A - Importing'!D10),ISBLANK('Part A - Importing'!D11)),\"C部分意见：制定系统方法的评价措施\",\"C部分说明：开发从 \"&'Part A - Importing'!D9&\" 到 \"&'Part A - Importing'!D10&\"的\"&'Part A - Importing'!D7&\" 贸易系统方法的措施评价\"&'Part A - Importing'!D11)","v":"C部分意见：制定系统方法的评价措施"}]
[null,"进口版本"]
[]
[]
[]
["表C1.措施指标（降低有害生物风险和实施标准）",null,null,null,null,null,null,null,"可选说明"]
[null,"可用的系统方法措施（来自B部分）","对降低出口货物中侵染有害生物风险的贡献",null,null,"实施标准",null,null,"与其他措施的互动",null,"其他说明",null,"措施目标"]
[null,null,"该措施对降低有害生物风险的最大贡献是： ",null,null,"该措施实地实施标准是："]
[null,null,"评分","不确定性","说明","评分","不确定性","说明"]
["i",{"$f":"IF('Part C - Importing'!B11=0,\"\",'Part C - Importing'!B11)","v":"输华樱桃果园、设施审核批准注册"},{"$f":"IF('Part C - Importing'!C11=0,\"\",'Part C - Importing'!C11)","v":""},{"$f":"IF('Part C - Importing'!D11=0,\"\",'Part C - Importing'!D11)","v":""},null,{"$f":"IF('Part C - Importing'!F11=0,\"\",'Part C - Importing'!F11)","v":""},{"$f":"IF('Part C - Importing'!G11=0,\"\",'Part C - Importing'!G11)","v":""},null,{"$f":"IF('Part C - Importing'!I11=0,\"\",'Part C - Importing'!I11)","v":""},{"$f":"IF('Part C - Exporting'!J11=0,\"\",'Part C - Exporting'!J11)","v":""},{"$f":"IF('Part C - Importing'!K11=0,\"\",'Part C - Importing'!K11)","v":""},{"$f":"IF('Part C - Exporting'!L11=0,\"\",'Part C - Exporting'!L11)","v":""},{"$f":"IF('Part C - Importing'!M11=0,\"\",'Part C - Importing'!M11)","v":""}]
["ii",{"$f":"IF('Part C - Importing'!B12=0,\"\",'Part C - Importing'!B12)","v":"输华樱桃果园内不得种植其他植物。"},{"$f":"IF('Part C - Importing'!C12=0,\"\",'Part C - Importing'!C12)","v":""},{"$f":"IF('Part C - Importing'!D12=0,\"\",'Part C - Importing'!D12)","v":""},null,{"$f":"IF('Part C - Importing'!F12=0,\"\",'Part C - Importing'!F12)","v":""},{"$f":"IF('Part C - Importing'!G12=0,\"\",'Part C - Importing'!G12)","v":""},null,{"$f":"IF('Part C - Importing'!I12=0,\"\",'Part C - Importing'!I12)","v":""},{"$f":"IF('Part C - Exporting'!J12=0,\"\",'Part C - Exporting'!J12)","v":""},{"$f":"IF('Part C - Importing'!K12=0,\"\",'Part C - Importing'!K12)","v":""},{"$f":"IF('Part C - Exporting'!L12=0,\"\",'Part C - Exporting'!L12)","v":""},{"$f":"IF('Part C - Importing'!M12=0,\"\",'Part C - Importing'!M12)","v":""}]
["iii",{"$f":"IF('Part C - Importing'!B13=0,\"\",'Part C - Importing'!B13)","v":"输华樱桃必须来自苹果蠹蛾的非疫生产点（PFPSs）并采取有效的预防控制措施，非疫生产点的建立应遵循ISPM10的原则。"},{"$f":"IF('Part C - Importing'!C13=0,\"\",'Part C - Importing'!C13)","v":""},{"$f":"IF('Part C - Importing'!D13=0,\"\",'Part C - Importing'!D13)","v":""},null,{"$f":"IF('Part C - Importing'!F13=0,\"\",'Part C - Importing'!F13)","v":""},{"$f":"IF('Part C - Importing'!G13=0,\"\",'Part C - Importing'!G13)","v":""},null,{"$f":"IF('Part C - Importing'!I13=0,\"\",'Part C - Importing'!I13)","v":""},{"$f":"IF('Part C - Exporting'!J13=0,\"\",'Part C - Exporting'!J13)","v":""},{"$f":"IF('Part C - Importing'!K13=0,\"\",'Part C - Importing'!K13)","v":""},{"$f":"IF('Part C - Exporting'!L13=0,\"\",'Part C - Exporting'!L13)","v":""},{"$f":"IF('Part C - Importing'!M13=0,\"\",'Part C - Importing'!M13)","v":""}]
["iv",{"$f":"IF('Part C - Importing'!B14=0,\"\",'Part C - Importing'!B14)","v":"培训技术人员"},{"$f":"IF('Part C - Importing'!C14=0,\"\",'Part C - Importing'!C14)","v":""},{"$f":"IF('Part C - Importing'!D14=0,\"\",'Part C - Importing'!D14)","v":""},null,{"$f":"IF('Part C - Importing'!F14=0,\"\",'Part C - Importing'!F14)","v":""},{"$f":"IF('Part C - Importing'!G14=0,\"\",'Part C - Importing'!G14)","v":""},null,{"$f":"IF('Part C - Importing'!I14=0,\"\",'Part C - Importing'!I14)","v":""},{"$f":"IF('Part C - Exporting'!J14=0,\"\",'Part C - Exporting'!J14)","v":""},{"$f":"IF('Part C - Importing'!K14=0,\"\",'Part C - Importing'!K14)","v":""},{"$f":"IF('Part C - Exporting'!L14=0,\"\",'Part C - Exporting'!L14)","v":""},{"$f":"IF('Part C - Importing'!M14=0,\"\",'Part C - Importing'!M14)","v":""}]
["v",{"$f":"IF('Part C - Importing'!B15=0,\"\",'Part C - Importing'!B15)","v":"施良好农业规范（GAP）、执行有害生物综合防治（IPM）"},{"$f":"IF('Part C - Importing'!C15=0,\"\",'Part C - Importing'!C15)","v":""},{"$f":"IF('Part C - Importing'!D15=0,\"\",'Part C - Importing'!D15)","v":""},null,{"$f":"IF('Part C - Importing'!F15=0,\"\",'Part C - Importing'!F15)","v":""},{"$f":"IF('Part C - Importing'!G15=0,\"\",'Part C - Importing'!G15)","v":""},null,{"$f":"IF('Part C - Importing'!I15=0,\"\",'Part C - Importing'!I15)","v":""},{"$f":"IF('Part C - Exporting'!J15=0,\"\",'Part C - Exporting'!J15)","v":""},{"$f":"IF('Part C - Importing'!K15=0,\"\",'Part C - Importing'!K15)","v":""},{"$f":"IF('Part C - Exporting'!L15=0,\"\",'Part C - Exporting'!L15)","v":""},{"$f":"IF('Part C - Importing'!M15=0,\"\",'Part C - Importing'!M15)","v":""}]
["vi",{"$f":"IF('Part C - Importing'!B16=0,\"\",'Part C - Importing'!B16)","v":"果园监控：对苹果蠹蛾的监测调查从盛花期开始，一直到樱桃的包装工作结束。"},{"$f":"IF('Part C - Importing'!C16=0,\"\",'Part C - Importing'!C16)","v":""},{"$f":"IF('Part C - Importing'!D16=0,\"\",'Part C - Importing'!D16)","v":""},null,{"$f":"IF('Part C - Importing'!F16=0,\"\",'Part C - Importing'!F16)","v":""},{"$f":"IF('Part C - Importing'!G16=0,\"\",'Part C - Importing'!G16)","v":""},null,{"$f":"IF('Part C - Importing'!I16=0,\"\",'Part C - Importing'!I16)","v":""},{"$f":"IF('Part C - Exporting'!J16=0,\"\",'Part C - Exporting'!J16)","v":""},{"$f":"IF('Part C - Importing'!K16=0,\"\",'Part C - Importing'!K16)","v":""},{"$f":"IF('Part C - Exporting'!L16=0,\"\",'Part C - Exporting'!L16)","v":""},{"$f":"IF('Part C - Importing'!M16=0,\"\",'Part C - Importing'!M16)","v":""}]
["vii",{"$f":"IF('Part C - Importing'!B17=0,\"\",'Part C - Importing'!B17)","v":"果园监控：对苹果蠹蛾的监测调查从盛花期开始，一直到樱桃的包装工作结束。"},{"$f":"IF('Part C - Importing'!C17=0,\"\",'Part C - Importing'!C17)","v":""},{"$f":"IF('Part C - Importing'!D17=0,\"\",'Part C - Importing'!D17)","v":""},null,{"$f":"IF('Part C - Importing'!F17=0,\"\",'Part C - Importing'!F17)","v":""},{"$f":"IF('Part C - Importing'!G17=0,\"\",'Part C - Importing'!G17)","v":""},null,{"$f":"IF('Part C - Importing'!I17=0,\"\",'Part C - Importing'!I17)","v":""},{"$f":"IF('Part C - Exporting'!J17=0,\"\",'Part C - Exporting'!J17)","v":""},{"$f":"IF('Part C - Importing'!K17=0,\"\",'Part C - Importing'!K17)","v":""},{"$f":"IF('Part C - Exporting'!L17=0,\"\",'Part C - Exporting'!L17)","v":""},{"$f":"IF('Part C - Importing'!M17=0,\"\",'Part C - Importing'!M17)","v":""}]
["viii",{"$f":"IF('Part C - Importing'!B18=0,\"\",'Part C - Importing'!B18)","v":"输华樱桃加工、包装、储藏和装运过程，须在乌方或乌方授权人员检疫监管下进行。"},{"$f":"IF('Part C - Importing'!C18=0,\"\",'Part C - Importing'!C18)","v":""},{"$f":"IF('Part C - Importing'!D18=0,\"\",'Part C - Importing'!D18)","v":""},null,{"$f":"IF('Part C - Importing'!F18=0,\"\",'Part C - Importing'!F18)","v":""},{"$f":"IF('Part C - Importing'!G18=0,\"\",'Part C - Importing'!G18)","v":""},null,{"$f":"IF('Part C - Importing'!I18=0,\"\",'Part C - Importing'!I18)","v":""},{"$f":"IF('Part C - Exporting'!J18=0,\"\",'Part C - Exporting'!J18)","v":""},{"$f":"IF('Part C - Importing'!K18=0,\"\",'Part C - Importing'!K18)","v":""},{"$f":"IF('Part C - Exporting'!L18=0,\"\",'Part C - Exporting'!L18)","v":""},{"$f":"IF('Part C - Importing'!M18=0,\"\",'Part C - Importing'!M18)","v":""}]
["ix",{"$f":"IF('Part C - Importing'!B19=0,\"\",'Part C - Importing'!B19)","v":"在加工、包装过程中，须对樱桃进行挑选、分拣和处理，以保证输华的樱桃不带有昆虫、螨类、烂果及枝、叶、根和土壤。"},{"$f":"IF('Part C - Importing'!C19=0,\"\",'Part C - Importing'!C19)","v":""},{"$f":"IF('Part C - Importing'!D19=0,\"\",'Part C - Importing'!D19)","v":""},null,{"$f":"IF('Part C - Importing'!F19=0,\"\",'Part C - Importing'!F19)","v":""},{"$f":"IF('Part C - Importing'!G19=0,\"\",'Part C - Importing'!G19)","v":""},null,{"$f":"IF('Part C - Importing'!I19=0,\"\",'Part C - Importing'!I19)","v":""},{"$f":"IF('Part C - Exporting'!J19=0,\"\",'Part C - Exporting'!J19)","v":""},{"$f":"IF('Part C - Importing'!K19=0,\"\",'Part C - Importing'!K19)","v":""},{"$f":"IF('Part C - Exporting'!L19=0,\"\",'Part C - Exporting'!L19)","v":""},{"$f":"IF('Part C - Importing'!M19=0,\"\",'Part C - Importing'!M19)","v":""}]
["x",{"$f":"IF('Part C - Importing'!B20=0,\"\",'Part C - Importing'!B20)","v":"对输华樱桃要使用专门的包装线，不得同时包装其他水果，避免被有害生物污染。"},{"$f":"IF('Part C - Importing'!C20=0,\"\",'Part C - Importing'!C20)","v":""},{"$f":"IF('Part C - Importing'!D20=0,\"\",'Part C - Importing'!D20)","v":""},null,{"$f":"IF('Part C - Importing'!F20=0,\"\",'Part C - Importing'!F20)","v":""},{"$f":"IF('Part C - Importing'!G20=0,\"\",'Part C - Importing'!G20)","v":""},null,{"$f":"IF('Part C - Importing'!I20=0,\"\",'Part C - Importing'!I20)","v":""},{"$f":"IF('Part C - Exporting'!J20=0,\"\",'Part C - Exporting'!J20)","v":""},{"$f":"IF('Part C - Importing'!K20=0,\"\",'Part C - Importing'!K20)","v":""},{"$f":"IF('Part C - Exporting'!L20=0,\"\",'Part C - Exporting'!L20)","v":""},{"$f":"IF('Part C - Importing'!M20=0,\"\",'Part C - Importing'!M20)","v":""}]
["xi",{"$f":"IF('Part C - Importing'!B21=0,\"\",'Part C - Importing'!B21)","v":"包装好的樱桃应单独储藏，避免受有害生物再感染。樱桃包装箱上应用英文标出水果名称、产地（地区和万户（Tuman））、果园和包装厂及其注册号。每个出口托盘包装上应有经MAWR确认的检疫标识。每个包装箱和托盘需用中文标出“输往中华人民共和国”。\n樱桃包装材料应干净卫生、未使用过，符合中国有关植物检疫要求。"},{"$f":"IF('Part C - Importing'!C21=0,\"\",'Part C - Importing'!C21)","v":""},{"$f":"IF('Part C - Importing'!D21=0,\"\",'Part C - Importing'!D21)","v":""},null,{"$f":"IF('Part C - Importing'!F21=0,\"\",'Part C - Importing'!F21)","v":""},{"$f":"IF('Part C - Importing'!G21=0,\"\",'Part C - Importing'!G21)","v":""},null,{"$f":"IF('Part C - Importing'!I21=0,\"\",'Part C - Importing'!I21)","v":""},{"$f":"IF('Part C - Exporting'!J21=0,\"\",'Part C - Exporting'!J21)","v":""},{"$f":"IF('Part C - Importing'!K21=0,\"\",'Part C - Importing'!K21)","v":""},{"$f":"IF('Part C - Exporting'!L21=0,\"\",'Part C - Exporting'!L21)","v":""},{"$f":"IF('Part C - Importing'!M21=0,\"\",'Part C - Importing'!M21)","v":""}]
["xii",{"$f":"IF('Part C - Importing'!B22=0,\"\",'Part C - Importing'!B22)","v":"议定书实施的前两年，MAWR人员需按2%的抽样比例对输华樱桃实施出口检验检疫，最小取样量不得少于1200果，并对其中可疑果进行剖果检查。如果未发现检疫问题，此后抽样比例降低到1%，最小取样量不得少于600果。如果在出口检验检疫中，检出欧洲樱桃实蝇、葡萄花翅小卷蛾和苹果蠹蛾，MAWR将在本出口季节暂停该万户（Tuman）向中国出口，并通报AQSIQ。"},{"$f":"IF('Part C - Importing'!C22=0,\"\",'Part C - Importing'!C22)","v":""},{"$f":"IF('Part C - Importing'!D22=0,\"\",'Part C - Importing'!D22)","v":""},null,{"$f":"IF('Part C - Importing'!F22=0,\"\",'Part C - Importing'!F22)","v":""},{"$f":"IF('Part C - Importing'!G22=0,\"\",'Part C - Importing'!G22)","v":""},null,{"$f":"IF('Part C - Importing'!I22=0,\"\",'Part C - Importing'!I22)","v":""},{"$f":"IF('Part C - Exporting'!J22=0,\"\",'Part C - Exporting'!J22)","v":""},{"$f":"IF('Part C - Importing'!K22=0,\"\",'Part C - Importing'!K22)","v":""},{"$f":"IF('Part C - Exporting'!L22=0,\"\",'Part C - Exporting'!L22)","v":""},{"$f":"IF('Part C - Importing'!M22=0,\"\",'Part C - Importing'!M22)","v":""}]
["xiii",{"$f":"IF('Part C - Importing'!B23=0,\"\",'Part C - Importing'!B23)","v":"对检验检疫合格的货物，MAWR应签发植物检疫证书，并在附加声明中注明“该批樱桃符合《乌兹别克斯坦樱桃输华植物检疫要求议定书》的规定，不带中方关注的检疫性有害生物”。\nMAWR在开展贸易前向AQSIQ提供植物检疫证书样本，以便确认备案。"},{"$f":"IF('Part C - Importing'!C23=0,\"\",'Part C - Importing'!C23)","v":""},{"$f":"IF('Part C - Importing'!D23=0,\"\",'Part C - Importing'!D23)","v":""},null,{"$f":"IF('Part C - Importing'!F23=0,\"\",'Part C - Importing'!F23)","v":""},{"$f":"IF('Part C - Importing'!G23=0,\"\",'Part C - Importing'!G23)","v":""},null,{"$f":"IF('Part C - Importing'!I23=0,\"\",'Part C - Importing'!I23)","v":""},{"$f":"IF('Part C - Exporting'!J23=0,\"\",'Part C - Exporting'!J23)","v":""},{"$f":"IF('Part C - Importing'!K23=0,\"\",'Part C - Importing'!K23)","v":""},{"$f":"IF('Part C - Exporting'!L23=0,\"\",'Part C - Exporting'!L23)","v":""},{"$f":"IF('Part C - Importing'!M23=0,\"\",'Part C - Importing'!M23)","v":""}]
["xiv",{"$f":"IF('Part C - Importing'!B24=0,\"\",'Part C - Importing'!B24)","v":"对于实施出口前冷处理的樱桃，应在植物检疫证书上注明检疫处理方式、处理温度、持续时间及处理设施名称或编号等信息。对于实施运输途中冷处理的，应在植物检疫证书上标注“Cold treatment in transit”（途中冷处理），并注明冷处理的温度、处理时间、集装箱号码及封识号码等。"},{"$f":"IF('Part C - Importing'!C24=0,\"\",'Part C - Importing'!C24)","v":""},{"$f":"IF('Part C - Importing'!D24=0,\"\",'Part C - Importing'!D24)","v":""},null,{"$f":"IF('Part C - Importing'!F24=0,\"\",'Part C - Importing'!F24)","v":""},{"$f":"IF('Part C - Importing'!G24=0,\"\",'Part C - Importing'!G24)","v":""},null,{"$f":"IF('Part C - Importing'!I24=0,\"\",'Part C - Importing'!I24)","v":""},{"$f":"IF('Part C - Exporting'!J24=0,\"\",'Part C - Exporting'!J24)","v":""},{"$f":"IF('Part C - Importing'!K24=0,\"\",'Part C - Importing'!K24)","v":""},{"$f":"IF('Part C - Exporting'!L24=0,\"\",'Part C - Exporting'!L24)","v":""},{"$f":"IF('Part C - Importing'!M24=0,\"\",'Part C - Importing'!M24)","v":""}]
["xv",{"$f":"IF('Part C - Importing'!B25=0,\"\",'Part C - Importing'!B25)","v":"有关单证和标志进行核查，未经注册的果园、包装厂不准进境。如发现中方关注的任何检疫性有害生物，该批货物将作除害处理，退回或销毁处理。"},{"$f":"IF('Part C - Importing'!C25=0,\"\",'Part C - Importing'!C25)","v":""},{"$f":"IF('Part C - Importing'!D25=0,\"\",'Part C - Importing'!D25)","v":""},null,{"$f":"IF('Part C - Importing'!F25=0,\"\",'Part C - Importing'!F25)","v":""},{"$f":"IF('Part C - Importing'!G25=0,\"\",'Part C - Importing'!G25)","v":""},null,{"$f":"IF('Part C - Importing'!I25=0,\"\",'Part C - Importing'!I25)","v":""},{"$f":"IF('Part C - Exporting'!J25=0,\"\",'Part C - Exporting'!J25)","v":""},{"$f":"IF('Part C - Importing'!K25=0,\"\",'Part C - Importing'!K25)","v":""},{"$f":"IF('Part C - Exporting'!L25=0,\"\",'Part C - Exporting'!L25)","v":""},{"$f":"IF('Part C - Importing'!M25=0,\"\",'Part C - Importing'!M25)","v":""}]
["xvi",{"$f":"IF('Part C - Importing'!B26=0,\"\",'Part C - Importing'!B26)","v":"本项目开始前，在MAWR协助下，AQSIQ将派至少两名植物检疫官员赴乌兹别克斯坦对樱桃有害生物监测体系和输华樱桃相关产区、果园、包装厂的植物卫生要求进行实地考察，并根据考察结果确认输华樱桃的产区、果园、包装厂名单。"},{"$f":"IF('Part C - Importing'!C26=0,\"\",'Part C - Importing'!C26)","v":""},{"$f":"IF('Part C - Importing'!D26=0,\"\",'Part C - Importing'!D26)","v":""},null,{"$f":"IF('Part C - Importing'!F26=0,\"\",'Part C - Importing'!F26)","v":""},{"$f":"IF('Part C - Importing'!G26=0,\"\",'Part C - Importing'!G26)","v":""},null,{"$f":"IF('Part C - Importing'!I26=0,\"\",'Part C - Importing'!I26)","v":""},{"$f":"IF('Part C - Exporting'!J26=0,\"\",'Part C - Exporting'!J26)","v":""},{"$f":"IF('Part C - Importing'!K26=0,\"\",'Part C - Importing'!K26)","v":""},{"$f":"IF('Part C - Exporting'!L26=0,\"\",'Part C - Exporting'!L26)","v":""},{"$f":"IF('Part C - Importing'!M26=0,\"\",'Part C - Importing'!M26)","v":""}]
["xvii",{"$f":"IF('Part C - Importing'!B27=0,\"\",'Part C - Importing'!B27)","v":"在贸易过程中，AQSIQ将根据乌兹别克斯坦樱桃疫情发生动态及截获情况开展进一步的风险评估，并与MAWR协商，以适时调整检疫性有害生物名单及相应的检疫措施。为确保有关风险管理措施和操作要求的有效落实，AQSIQ和MAWR将按照相应的程序和规章对本议定书执行情况进行审核和评估。"},{"$f":"IF('Part C - Importing'!C27=0,\"\",'Part C - Importing'!C27)","v":""},{"$f":"IF('Part C - Importing'!D27=0,\"\",'Part C - Importing'!D27)","v":""},null,{"$f":"IF('Part C - Importing'!F27=0,\"\",'Part C - Importing'!F27)","v":""},{"$f":"IF('Part C - Importing'!G27=0,\"\",'Part C - Importing'!G27)","v":""},null,{"$f":"IF('Part C - Importing'!I27=0,\"\",'Part C - Importing'!I27)","v":""},{"$f":"IF('Part C - Exporting'!J27=0,\"\",'Part C - Exporting'!J27)","v":""},{"$f":"IF('Part C - Importing'!K27=0,\"\",'Part C - Importing'!K27)","v":""},{"$f":"IF('Part C - Exporting'!L27=0,\"\",'Part C - Exporting'!L27)","v":""},{"$f":"IF('Part C - Importing'!M27=0,\"\",'Part C - Importing'!M27)","v":""}]
["xviii",{"$f":"IF('Part C - Importing'!B28=0,\"\",'Part C - Importing'!B28)","v":""},{"$f":"IF('Part C - Importing'!C28=0,\"\",'Part C - Importing'!C28)","v":""},{"$f":"IF('Part C - Importing'!D28=0,\"\",'Part C - Importing'!D28)","v":""},null,{"$f":"IF('Part C - Importing'!F28=0,\"\",'Part C - Importing'!F28)","v":""},{"$f":"IF('Part C - Importing'!G28=0,\"\",'Part C - Importing'!G28)","v":""},null,{"$f":"IF('Part C - Importing'!I28=0,\"\",'Part C - Importing'!I28)","v":""},{"$f":"IF('Part C - Exporting'!J28=0,\"\",'Part C - Exporting'!J28)","v":""},{"$f":"IF('Part C - Importing'!K28=0,\"\",'Part C - Importing'!K28)","v":""},{"$f":"IF('Part C - Exporting'!L28=0,\"\",'Part C - Exporting'!L28)","v":""},{"$f":"IF('Part C - Importing'!M28=0,\"\",'Part C - Importing'!M28)","v":""}]
["xix",{"$f":"IF('Part C - Importing'!B29=0,\"\",'Part C - Importing'!B29)","v":""},{"$f":"IF('Part C - Importing'!C29=0,\"\",'Part C - Importing'!C29)","v":""},{"$f":"IF('Part C - Importing'!D29=0,\"\",'Part C - Importing'!D29)","v":""},null,{"$f":"IF('Part C - Importing'!F29=0,\"\",'Part C - Importing'!F29)","v":""},{"$f":"IF('Part C - Importing'!G29=0,\"\",'Part C - Importing'!G29)","v":""},null,{"$f":"IF('Part C - Importing'!I29=0,\"\",'Part C - Importing'!I29)","v":""},{"$f":"IF('Part C - Exporting'!J29=0,\"\",'Part C - Exporting'!J29)","v":""},{"$f":"IF('Part C - Importing'!K29=0,\"\",'Part C - Importing'!K29)","v":""},{"$f":"IF('Part C - Exporting'!L29=0,\"\",'Part C - Exporting'!L29)","v":""},{"$f":"IF('Part C - Importing'!M29=0,\"\",'Part C - Importing'!M29)","v":""}]
["xx",{"$f":"IF('Part C - Importing'!B30=0,\"\",'Part C - Importing'!B30)","v":""},{"$f":"IF('Part C - Importing'!C30=0,\"\",'Part C - Importing'!C30)","v":""},{"$f":"IF('Part C - Importing'!D30=0,\"\",'Part C - Importing'!D30)","v":""},null,{"$f":"IF('Part C - Importing'!F30=0,\"\",'Part C - Importing'!F30)","v":""},{"$f":"IF('Part C - Importing'!G30=0,\"\",'Part C - Importing'!G30)","v":""},null,{"$f":"IF('Part C - Importing'!I30=0,\"\",'Part C - Importing'!I30)","v":""},{"$f":"IF('Part C - Exporting'!J30=0,\"\",'Part C - Exporting'!J30)","v":""},{"$f":"IF('Part C - Importing'!K30=0,\"\",'Part C - Importing'!K30)","v":""},{"$f":"IF('Part C - Exporting'!L30=0,\"\",'Part C - Exporting'!L30)","v":""},{"$f":"IF('Part C - Importing'!M30=0,\"\",'Part C - Importing'!M30)","v":""}]
[]
["表C2.措施指标（验证措施对控制点的影响的能力、生产者可接受度、行业可接受度、社会可接受度）"]
[null,{"$f":"B8","v":"可用的系统方法措施（来自B部分）"},"验证措施对控制点的影响的能力",null,null,"生产者可接受度",null,null,"行业可接受度",null,null,"社会可接受度 "]
[null,null,"使用控制点调整系统的能力是：",null,null,"生产者可接受度是： ",null,null,"行业可接受度是：",null,null,"社会可接受度是："]
[null,null,"评分","不确定性","说明","评分","不确定性","说明","评分","不确定性","说明","评分","不确定性","说明"]
["i",{"$f":"IF('Part C - Importing'!B36=0,\"\",'Part C - Importing'!B36)","v":"输华樱桃果园、设施审核批准注册"},{"$f":"IF('Part C - Importing'!C36=0,\"\",'Part C - Importing'!C36)","v":""},{"$f":"IF('Part C - Importing'!D36=0,\"\",'Part C - Importing'!D36)","v":""},null,{"$f":"IF('Part C - Importing'!F36=0,\"\",'Part C - Importing'!F36)","v":""},{"$f":"IF('Part C - Importing'!G36=0,\"\",'Part C - Importing'!G36)","v":""},null,{"$f":"IF('Part C - Importing'!I36=0,\"\",'Part C - Importing'!I36)","v":""},{"$f":"IF('Part C - Importing'!J36=0,\"\",'Part C - Importing'!J36)","v":""},null,{"$f":"IF('Part C - Importing'!L36=0,\"\",'Part C - Importing'!L36)","v":""},{"$f":"IF('Part C - Importing'!M36=0,\"\",'Part C - Importing'!M36)","v":""}]
["ii",{"$f":"IF('Part C - Importing'!B37=0,\"\",'Part C - Importing'!B37)","v":"输华樱桃果园内不得种植其他植物。"},{"$f":"IF('Part C - Importing'!C37=0,\"\",'Part C - Importing'!C37)","v":""},{"$f":"IF('Part C - Importing'!D37=0,\"\",'Part C - Importing'!D37)","v":""},null,{"$f":"IF('Part C - Importing'!F37=0,\"\",'Part C - Importing'!F37)","v":""},{"$f":"IF('Part C - Importing'!G37=0,\"\",'Part C - Importing'!G37)","v":""},null,{"$f":"IF('Part C - Importing'!I37=0,\"\",'Part C - Importing'!I37)","v":""},{"$f":"IF('Part C - Importing'!J37=0,\"\",'Part C - Importing'!J37)","v":""},null,{"$f":"IF('Part C - Importing'!L37=0,\"\",'Part C - Importing'!L37)","v":""},{"$f":"IF('Part C - Importing'!M37=0,\"\",'Part C - Importing'!M37)","v":""}]
["iii",{"$f":"IF('Part C - Importing'!B38=0,\"\",'Part C - Importing'!B38)","v":"输华樱桃必须来自苹果蠹蛾的非疫生产点（PFPSs）并采取有效的预防控制措施，非疫生产点的建立应遵循ISPM10的原则。"},{"$f":"IF('Part C - Importing'!C38=0,\"\",'Part C - Importing'!C38)","v":""},{"$f":"IF('Part C - Importing'!D38=0,\"\",'Part C - Importing'!D38)","v":""},null,{"$f":"IF('Part C - Importing'!F38=0,\"\",'Part C - Importing'!F38)","v":""},{"$f":"IF('Part C - Importing'!G38=0,\"\",'Part C - Importing'!G38)","v":""},null,{"$f":"IF('Part C - Importing'!I38=0,\"\",'Part C - Importing'!I38)","v":""},{"$f":"IF('Part C - Importing'!J38=0,\"\",'Part C - Importing'!J38)","v":""},null,{"$f":"IF('Part C - Importing'!L38=0,\"\",'Part C - Importing'!L38)","v":""},{"$f":"IF('Part C - Importing'!M38=0,\"\",'Part C - Importing'!M38)","v":""}]
["iv",{"$f":"IF('Part C - Importing'!B39=0,\"\",'Part C - Importing'!B39)","v":"培训技术人员"},{"$f":"IF('Part C - Importing'!C39=0,\"\",'Part C - Importing'!C39)","v":""},{"$f":"IF('Part C - Importing'!D39=0,\"\",'Part C - Importing'!D39)","v":""},null,{"$f":"IF('Part C - Importing'!F39=0,\"\",'Part C - Importing'!F39)","v":""},{"$f":"IF('Part C - Importing'!G39=0,\"\",'Part C - Importing'!G39)","v":""},null,{"$f":"IF('Part C - Importing'!I39=0,\"\",'Part C - Importing'!I39)","v":""},{"$f":"IF('Part C - Importing'!J39=0,\"\",'Part C - Importing'!J39)","v":""},null,{"$f":"IF('Part C - Importing'!L39=0,\"\",'Part C - Importing'!L39)","v":""},{"$f":"IF('Part C - Importing'!M39=0,\"\",'Part C - Importing'!M39)","v":""}]
["v",{"$f":"IF('Part C - Importing'!B40=0,\"\",'Part C - Importing'!B40)","v":"施良好农业规范（GAP）、执行有害生物综合防治（IPM）"},{"$f":"IF('Part C - Importing'!C40=0,\"\",'Part C - Importing'!C40)","v":""},{"$f":"IF('Part C - Importing'!D40=0,\"\",'Part C - Importing'!D40)","v":""},null,{"$f":"IF('Part C - Importing'!F40=0,\"\",'Part C - Importing'!F40)","v":""},{"$f":"IF('Part C - Importing'!G40=0,\"\",'Part C - Importing'!G40)","v":""},null,{"$f":"IF('Part C - Importing'!I40=0,\"\",'Part C - Importing'!I40)","v":""},{"$f":"IF('Part C - Importing'!J40=0,\"\",'Part C - Importing'!J40)","v":""},null,{"$f":"IF('Part C - Importing'!L40=0,\"\",'Part C - Importing'!L40)","v":""},{"$f":"IF('Part C - Importing'!M40=0,\"\",'Part C - Importing'!M40)","v":""}]
["vi",{"$f":"IF('Part C - Importing'!B41=0,\"\",'Part C - Importing'!B41)","v":"果园监控：对苹果蠹蛾的监测调查从盛花期开始，一直到樱桃的包装工作结束。"},{"$f":"IF('Part C - Importing'!C41=0,\"\",'Part C - Importing'!C41)","v":""},{"$f":"IF('Part C - Importing'!D41=0,\"\",'Part C - Importing'!D41)","v":""},null,{"$f":"IF('Part C - Importing'!F41=0,\"\",'Part C - Importing'!F41)","v":""},{"$f":"IF('Part C - Importing'!G41=0,\"\",'Part C - Importing'!G41)","v":""},null,{"$f":"IF('Part C - Importing'!I41=0,\"\",'Part C - Importing'!I41)","v":""},{"$f":"IF('Part C - Importing'!J41=0,\"\",'Part C - Importing'!J41)","v":""},null,{"$f":"IF('Part C - Importing'!L41=0,\"\",'Part C - Importing'!L41)","v":""},{"$f":"IF('Part C - Importing'!M41=0,\"\",'Part C - Importing'!M41)","v":""}]
["vii",{"$f":"IF('Part C - Importing'!B42=0,\"\",'Part C - Importing'!B42)","v":"果园监控：对苹果蠹蛾的监测调查从盛花期开始，一直到樱桃的包装工作结束。"},{"$f":"IF('Part C - Importing'!C42=0,\"\",'Part C - Importing'!C42)","v":""},{"$f":"IF('Part C - Importing'!D42=0,\"\",'Part C - Importing'!D42)","v":""},null,{"$f":"IF('Part C - Importing'!F42=0,\"\",'Part C - Importing'!F42)","v":""},{"$f":"IF('Part C - Importing'!G42=0,\"\",'Part C - Importing'!G42)","v":""},null,{"$f":"IF('Part C - Importing'!I42=0,\"\",'Part C - Importing'!I42)","v":""},{"$f":"IF('Part C - Importing'!J42=0,\"\",'Part C - Importing'!J42)","v":""},null,{"$f":"IF('Part C - Importing'!L42=0,\"\",'Part C - Importing'!L42)","v":""},{"$f":"IF('Part C - Importing'!M42=0,\"\",'Part C - Importing'!M42)","v":""}]
["viii",{"$f":"IF('Part C - Importing'!B43=0,\"\",'Part C - Importing'!B43)","v":"输华樱桃加工、包装、储藏和装运过程，须在乌方或乌方授权人员检疫监管下进行。"},{"$f":"IF('Part C - Importing'!C43=0,\"\",'Part C - Importing'!C43)","v":""},{"$f":"IF('Part C - Importing'!D43=0,\"\",'Part C - Importing'!D43)","v":""},null,{"$f":"IF('Part C - Importing'!F43=0,\"\",'Part C - Importing'!F43)","v":""},{"$f":"IF('Part C - Importing'!G43=0,\"\",'Part C - Importing'!G43)","v":""},null,{"$f":"IF('Part C - Importing'!I43=0,\"\",'Part C - Importing'!I43)","v":""},{"$f":"IF('Part C - Importing'!J43=0,\"\",'Part C - Importing'!J43)","v":""},null,{"$f":"IF('Part C - Importing'!L43=0,\"\",'Part C - Importing'!L43)","v":""},{"$f":"IF('Part C - Importing'!M43=0,\"\",'Part C - Importing'!M43)","v":""}]
["ix",{"$f":"IF('Part C - Importing'!B44=0,\"\",'Part C - Importing'!B44)","v":"在加工、包装过程中，须对樱桃进行挑选、分拣和处理，以保证输华的樱桃不带有昆虫、螨类、烂果及枝、叶、根和土壤。"},{"$f":"IF('Part C - Importing'!C44=0,\"\",'Part C - Importing'!C44)","v":""},{"$f":"IF('Part C - Importing'!D44=0,\"\",'Part C - Importing'!D44)","v":""},null,{"$f":"IF('Part C - Importing'!F44=0,\"\",'Part C - Importing'!F44)","v":""},{"$f":"IF('Part C - Importing'!G44=0,\"\",'Part C - Importing'!G44)","v":""},null,{"$f":"IF('Part C - Importing'!I44=0,\"\",'Part C - Importing'!I44)","v":""},{"$f":"IF('Part C - Importing'!J44=0,\"\",'Part C - Importing'!J44)","v":""},null,{"$f":"IF('Part C - Importing'!L44=0,\"\",'Part C - Importing'!L44)","v":""},{"$f":"IF('Part C - Importing'!M44=0,\"\",'Part C - Importing'!M44)","v":""}]
["x",{"$f":"IF('Part C - Importing'!B45=0,\"\",'Part C - Importing'!B45)","v":"对输华樱桃要使用专门的包装线，不得同时包装其他水果，避免被有害生物污染。"},{"$f":"IF('Part C - Importing'!C45=0,\"\",'Part C - Importing'!C45)","v":""},{"$f":"IF('Part C - Importing'!D45=0,\"\",'Part C - Importing'!D45)","v":""},null,{"$f":"IF('Part C - Importing'!F45=0,\"\",'Part C - Importing'!F45)","v":""},{"$f":"IF('Part C - Importing'!G45=0,\"\",'Part C - Importing'!G45)","v":""},null,{"$f":"IF('Part C - Importing'!I45=0,\"\",'Part C - Importing'!I45)","v":""},{"$f":"IF('Part C - Importing'!J45=0,\"\",'Part C - Importing'!J45)","v":""},null,{"$f":"IF('Part C - Importing'!L45=0,\"\",'Part C - Importing'!L45)","v":""},{"$f":"IF('Part C - Importing'!M45=0,\"\",'Part C - Importing'!M45)","v":""}]
["xi",{"$f":"IF('Part C - Importing'!B46=0,\"\",'Part C - Importing'!B46)","v":"包装好的樱桃应单独储藏，避免受有害生物再感染。樱桃包装箱上应用英文标出水果名称、产地（地区和万户（Tuman））、果园和包装厂及其注册号。每个出口托盘包装上应有经MAWR确认的检疫标识。每个包装箱和托盘需用中文标出“输往中华人民共和国”。\n樱桃包装材料应干净卫生、未使用过，符合中国有关植物检疫要求。"},{"$f":"IF('Part C - Importing'!C46=0,\"\",'Part C - Importing'!C46)","v":""},{"$f":"IF('Part C - Importing'!D46=0,\"\",'Part C - Importing'!D46)","v":""},null,{"$f":"IF('Part C - Importing'!F46=0,\"\",'Part C - Importing'!F46)","v":""},{"$f":"IF('Part C - Importing'!G46=0,\"\",'Part C - Importing'!G46)","v":""},null,{"$f":"IF('Part C - Importing'!I46=0,\"\",'Part C - Importing'!I46)","v":""},{"$f":"IF('Part C - Importing'!J46=0,\"\",'Part C - Importing'!J46)","v":""},null,{"$f":"IF('Part C - Importing'!L46=0,\"\",'Part C - Importing'!L46)","v":""},{"$f":"IF('Part C - Importing'!M46=0,\"\",'Part C - Importing'!M46)","v":""}]
["xii",{"$f":"IF('Part C - Importing'!B47=0,\"\",'Part C - Importing'!B47)","v":"议定书实施的前两年，MAWR人员需按2%的抽样比例对输华樱桃实施出口检验检疫，最小取样量不得少于1200果，并对其中可疑果进行剖果检查。如果未发现检疫问题，此后抽样比例降低到1%，最小取样量不得少于600果。如果在出口检验检疫中，检出欧洲樱桃实蝇、葡萄花翅小卷蛾和苹果蠹蛾，MAWR将在本出口季节暂停该万户（Tuman）向中国出口，并通报AQSIQ。"},{"$f":"IF('Part C - Importing'!C47=0,\"\",'Part C - Importing'!C47)","v":""},{"$f":"IF('Part C - Importing'!D47=0,\"\",'Part C - Importing'!D47)","v":""},null,{"$f":"IF('Part C - Importing'!F47=0,\"\",'Part C - Importing'!F47)","v":""},{"$f":"IF('Part C - Importing'!G47=0,\"\",'Part C - Importing'!G47)","v":""},null,{"$f":"IF('Part C - Importing'!I47=0,\"\",'Part C - Importing'!I47)","v":""},{"$f":"IF('Part C - Importing'!J47=0,\"\",'Part C - Importing'!J47)","v":""},null,{"$f":"IF('Part C - Importing'!L47=0,\"\",'Part C - Importing'!L47)","v":""},{"$f":"IF('Part C - Importing'!M47=0,\"\",'Part C - Importing'!M47)","v":""}]
["xiii",{"$f":"IF('Part C - Importing'!B48=0,\"\",'Part C - Importing'!B48)","v":"对检验检疫合格的货物，MAWR应签发植物检疫证书，并在附加声明中注明“该批樱桃符合《乌兹别克斯坦樱桃输华植物检疫要求议定书》的规定，不带中方关注的检疫性有害生物”。\nMAWR在开展贸易前向AQSIQ提供植物检疫证书样本，以便确认备案。"},{"$f":"IF('Part C - Importing'!C48=0,\"\",'Part C - Importing'!C48)","v":""},{"$f":"IF('Part C - Importing'!D48=0,\"\",'Part C - Importing'!D48)","v":""},null,{"$f":"IF('Part C - Importing'!F48=0,\"\",'Part C - Importing'!F48)","v":""},{"$f":"IF('Part C - Importing'!G48=0,\"\",'Part C - Importing'!G48)","v":""},null,{"$f":"IF('Part C - Importing'!I48=0,\"\",'Part C - Importing'!I48)","v":""},{"$f":"IF('Part C - Importing'!J48=0,\"\",'Part C - Importing'!J48)","v":""},null,{"$f":"IF('Part C - Importing'!L48=0,\"\",'Part C - Importing'!L48)","v":""},{"$f":"IF('Part C - Importing'!M48=0,\"\",'Part C - Importing'!M48)","v":""}]
["xiv",{"$f":"IF('Part C - Importing'!B49=0,\"\",'Part C - Importing'!B49)","v":"对于实施出口前冷处理的樱桃，应在植物检疫证书上注明检疫处理方式、处理温度、持续时间及处理设施名称或编号等信息。对于实施运输途中冷处理的，应在植物检疫证书上标注“Cold treatment in transit”（途中冷处理），并注明冷处理的温度、处理时间、集装箱号码及封识号码等。"},{"$f":"IF('Part C - Importing'!C49=0,\"\",'Part C - Importing'!C49)","v":""},{"$f":"IF('Part C - Importing'!D49=0,\"\",'Part C - Importing'!D49)","v":""},null,{"$f":"IF('Part C - Importing'!F49=0,\"\",'Part C - Importing'!F49)","v":""},{"$f":"IF('Part C - Importing'!G49=0,\"\",'Part C - Importing'!G49)","v":""},null,{"$f":"IF('Part C - Importing'!I49=0,\"\",'Part C - Importing'!I49)","v":""},{"$f":"IF('Part C - Importing'!J49=0,\"\",'Part C - Importing'!J49)","v":""},null,{"$f":"IF('Part C - Importing'!L49=0,\"\",'Part C - Importing'!L49)","v":""},{"$f":"IF('Part C - Importing'!M49=0,\"\",'Part C - Importing'!M49)","v":""}]
["xv",{"$f":"IF('Part C - Importing'!B50=0,\"\",'Part C - Importing'!B50)","v":"有关单证和标志进行核查，未经注册的果园、包装厂不准进境。如发现中方关注的任何检疫性有害生物，该批货物将作除害处理，退回或销毁处理。"},{"$f":"IF('Part C - Importing'!C50=0,\"\",'Part C - Importing'!C50)","v":""},{"$f":"IF('Part C - Importing'!D50=0,\"\",'Part C - Importing'!D50)","v":""},null,{"$f":"IF('Part C - Importing'!F50=0,\"\",'Part C - Importing'!F50)","v":""},{"$f":"IF('Part C - Importing'!G50=0,\"\",'Part C - Importing'!G50)","v":""},null,{"$f":"IF('Part C - Importing'!I50=0,\"\",'Part C - Importing'!I50)","v":""},{"$f":"IF('Part C - Importing'!J50=0,\"\",'Part C - Importing'!J50)","v":""},null,{"$f":"IF('Part C - Importing'!L50=0,\"\",'Part C - Importing'!L50)","v":""},{"$f":"IF('Part C - Importing'!M50=0,\"\",'Part C - Importing'!M50)","v":""}]
["xvi",{"$f":"IF('Part C - Importing'!B51=0,\"\",'Part C - Importing'!B51)","v":"本项目开始前，在MAWR协助下，AQSIQ将派至少两名植物检疫官员赴乌兹别克斯坦对樱桃有害生物监测体系和输华樱桃相关产区、果园、包装厂的植物卫生要求进行实地考察，并根据考察结果确认输华樱桃的产区、果园、包装厂名单。"},{"$f":"IF('Part C - Importing'!C51=0,\"\",'Part C - Importing'!C51)","v":""},{"$f":"IF('Part C - Importing'!D51=0,\"\",'Part C - Importing'!D51)","v":""},null,{"$f":"IF('Part C - Importing'!F51=0,\"\",'Part C - Importing'!F51)","v":""},{"$f":"IF('Part C - Importing'!G51=0,\"\",'Part C - Importing'!G51)","v":""},null,{"$f":"IF('Part C - Importing'!I51=0,\"\",'Part C - Importing'!I51)","v":""},{"$f":"IF('Part C - Importing'!J51=0,\"\",'Part C - Importing'!J51)","v":""},null,{"$f":"IF('Part C - Importing'!L51=0,\"\",'Part C - Importing'!L51)","v":""},{"$f":"IF('Part C - Importing'!M51=0,\"\",'Part C - Importing'!M51)","v":""}]
["xvii",{"$f":"IF('Part C - Importing'!B52=0,\"\",'Part C - Importing'!B52)","v":"在贸易过程中，AQSIQ将根据乌兹别克斯坦樱桃疫情发生动态及截获情况开展进一步的风险评估，并与MAWR协商，以适时调整检疫性有害生物名单及相应的检疫措施。为确保有关风险管理措施和操作要求的有效落实，AQSIQ和MAWR将按照相应的程序和规章对本议定书执行情况进行审核和评估。"},{"$f":"IF('Part C - Importing'!C52=0,\"\",'Part C - Importing'!C52)","v":""},{"$f":"IF('Part C - Importing'!D52=0,\"\",'Part C - Importing'!D52)","v":""},null,{"$f":"IF('Part C - Importing'!F52=0,\"\",'Part C - Importing'!F52)","v":""},{"$f":"IF('Part C - Importing'!G52=0,\"\",'Part C - Importing'!G52)","v":""},null,{"$f":"IF('Part C - Importing'!I52=0,\"\",'Part C - Importing'!I52)","v":""},{"$f":"IF('Part C - Importing'!J52=0,\"\",'Part C - Importing'!J52)","v":""},null,{"$f":"IF('Part C - Importing'!L52=0,\"\",'Part C - Importing'!L52)","v":""},{"$f":"IF('Part C - Importing'!M52=0,\"\",'Part C - Importing'!M52)","v":""}]
["xviii",{"$f":"IF('Part C - Importing'!B53=0,\"\",'Part C - Importing'!B53)","v":""},{"$f":"IF('Part C - Importing'!C53=0,\"\",'Part C - Importing'!C53)","v":""},{"$f":"IF('Part C - Importing'!D53=0,\"\",'Part C - Importing'!D53)","v":""},null,{"$f":"IF('Part C - Importing'!F53=0,\"\",'Part C - Importing'!F53)","v":""},{"$f":"IF('Part C - Importing'!G53=0,\"\",'Part C - Importing'!G53)","v":""},null,{"$f":"IF('Part C - Importing'!I53=0,\"\",'Part C - Importing'!I53)","v":""},{"$f":"IF('Part C - Importing'!J53=0,\"\",'Part C - Importing'!J53)","v":""},null,{"$f":"IF('Part C - Importing'!L53=0,\"\",'Part C - Importing'!L53)","v":""},{"$f":"IF('Part C - Importing'!M53=0,\"\",'Part C - Importing'!M53)","v":""}]
["xix",{"$f":"IF('Part C - Importing'!B54=0,\"\",'Part C - Importing'!B54)","v":""},{"$f":"IF('Part C - Importing'!C54=0,\"\",'Part C - Importing'!C54)","v":""},{"$f":"IF('Part C - Importing'!D54=0,\"\",'Part C - Importing'!D54)","v":""},null,{"$f":"IF('Part C - Importing'!F54=0,\"\",'Part C - Importing'!F54)","v":""},{"$f":"IF('Part C - Importing'!G54=0,\"\",'Part C - Importing'!G54)","v":""},null,{"$f":"IF('Part C - Importing'!I54=0,\"\",'Part C - Importing'!I54)","v":""},{"$f":"IF('Part C - Importing'!J54=0,\"\",'Part C - Importing'!J54)","v":""},null,{"$f":"IF('Part C - Importing'!L54=0,\"\",'Part C - Importing'!L54)","v":""},{"$f":"IF('Part C - Importing'!M54=0,\"\",'Part C - Importing'!M54)","v":""}]
["xx",{"$f":"IF('Part C - Importing'!B55=0,\"\",'Part C - Importing'!B55)","v":""},{"$f":"IF('Part C - Importing'!C55=0,\"\",'Part C - Importing'!C55)","v":""},{"$f":"IF('Part C - Importing'!D55=0,\"\",'Part C - Importing'!D55)","v":""},null,{"$f":"IF('Part C - Importing'!F55=0,\"\",'Part C - Importing'!F55)","v":""},{"$f":"IF('Part C - Importing'!G55=0,\"\",'Part C - Importing'!G55)","v":""},null,{"$f":"IF('Part C - Importing'!I55=0,\"\",'Part C - Importing'!I55)","v":""},{"$f":"IF('Part C - Importing'!J55=0,\"\",'Part C - Importing'!J55)","v":""},null,{"$f":"IF('Part C - Importing'!L55=0,\"\",'Part C - Importing'!L55)","v":""},{"$f":"IF('Part C - Importing'!M55=0,\"\",'Part C - Importing'!M55)","v":""}]
[]
[]
[]
[]
[]
[]
[]
[]
[{"$f":"'Part C - Importing'!A64","v":"表C3：整合系统方法措施"}]
[null,"拟议的系统方法包的参考名称"," 措施1"," 措施2"," 措施3"," 措施4"," 措施5"," 措施6"," 措施7"," 措施8"," 措施9"," 措施10"," 措施11"," 措施12"," 措施13"," 措施14"," 措施15"," 措施16"," 措施17"," 措施18"," 措施19"," 措施20"]
[null,"系统方法",{"$f":"IF('Part C - Importing'!D66=0,\"\",'Part C - Importing'!D66)","v":""},{"$f":"IF('Part C - Importing'!E66=0,\"\",'Part C - Importing'!E66)","v":""},{"$f":"IF('Part C - Importing'!F66=0,\"\",'Part C - Importing'!F66)","v":""},{"$f":"IF('Part C - Importing'!G66=0,\"\",'Part C - Importing'!G66)","v":""},{"$f":"IF('Part C - Importing'!H66=0,\"\",'Part C - Importing'!H66)","v":""},{"$f":"IF('Part C - Importing'!I66=0,\"\",'Part C - Importing'!I66)","v":""},{"$f":"IF('Part C - Importing'!J66=0,\"\",'Part C - Importing'!J66)","v":""},{"$f":"IF('Part C - Importing'!K66=0,\"\",'Part C - Importing'!K66)","v":""},{"$f":"IF('Part C - Importing'!L66=0,\"\",'Part C - Importing'!L66)","v":""},{"$f":"IF('Part C - Importing'!M66=0,\"\",'Part C - Importing'!M66)","v":""},{"$f":"IF('Part C - Importing'!N66=0,\"\",'Part C - Importing'!N66)","v":""},{"$f":"IF('Part C - Importing'!O66=0,\"\",'Part C - Importing'!O66)","v":""},{"$f":"IF('Part C - Importing'!P66=0,\"\",'Part C - Importing'!P66)","v":""},{"$f":"IF('Part C - Importing'!Q66=0,\"\",'Part C - Importing'!Q66)","v":""},{"$f":"IF('Part C - Importing'!R66=0,\"\",'Part C - Importing'!R66)","v":""},{"$f":"IF('Part C - Importing'!S66=0,\"\",'Part C - Importing'!S66)","v":""},{"$f":"IF('Part C - Importing'!T66=0,\"\",'Part C - Importing'!T66)","v":""},{"$f":"IF('Part C - Importing'!U66=0,\"\",'Part C - Importing'!U66)","v":""},{"$f":"IF('Part C - Importing'!V66=0,\"\",'Part C - Importing'!V66)","v":""},{"$f":"IF('Part C - Importing'!W66=0,\"\",'Part C - Importing'!W66)","v":""}]
[]
[]
[]
[]
[{"$f":"'Part C - Importing'!A82","v":"表C4：系统方法的总体预期绩效"}]
[null,"系统方法包","对系统方法的预期整体绩效进行评分",null,null,"其他说明"]
[null,null,"评分","不确定性","说明","验证措施的方法"]
[null,{"$f":"IF(B66=0,\"\",B66)","v":"系统方法"},{"$f":"IF('Part C - Importing'!C85=0,\"\",'Part C - Importing'!C85)","v":""},{"$f":"IF('Part C - Importing'!D85=0,\"\",'Part C - Importing'!D85)","v":""},null,{"$f":"IF('Part C - Importing'!F85=0,\"\",'Part C - Importing'!F85)","v":""},{"$f":"IF('Part C - Exporting'!G85=0,\"\",'Part C - Exporting'!G85)","v":""}]

{"sheet":"Contrib Refs Res","index":9,"n_rows":225,"n_cols":26,"rows_kept":225,"cut":false,"hidden":false,"merged":[[2,6,2,11],[3,6,3,11],[4,6,4,11],[5,6,5,11],[11,1,11,5],[11,6,11,9],[11,10,11,14],[11,15,11,19],[11,20,11,22],[12,1,12,5],[12,6,12,9],[12,10,12,14],[12,15,12,19],[12,20,12,22],[13,1,13,5],[13,6,13,9],[13,10,13,14],[13,15,13,19],[13,20,13,22],[14,1,14,5],[14,6,14,9],[14,10,14,14],[14,15,14,19],[14,20,14,22],[15,1,15,5],[15,6,15,9],[15,10,15,14],[15,15,15,19],[15,20,15,22],[16,1,16,5],[16,6,16,9],[16,10,16,14],[16,15,16,19],[16,20,16,22],[17,1,17,5],[17,6,17,9],[17,10,17,14],[17,15,17,19],[17,20,17,22],[18,1,18,5],[18,6,18,9],[18,10,18,14],[18,15,18,19],[18,20,18,22],[19,1,19,5],[19,6,19,9],[19,10,19,14],[19,15,19,19],[19,20,19,22],[22,1,22,9],[22,10,22,13],[22,14,22,18],[22,20,22,22],[23,1,23,9],[23,10,23,13],[23,14,23,19],[23,20,23,22],[24,1,24,9],[24,10,24,13],[24,14,24,19],[24,20,24,22],[25,1,25,9],[25,10,25,13],[25,14,25,19],[25,20,25,22],[26,1,26,9],[26,10,26,13],[26,14,26,19],[26,20,26,22],[27,1,27,9],[27,10,27,13],[27,14,27,19],[27,20,27,22],[28,1,28,9],[28,10,28,13],[28,14,28,19],[28,20,28,22],[29,1,29,9],[29,10,29,13],[29,14,29,19],[29,20,29,22],[30,1,30,9],[30,10,30,13],[30,14,30,19],[30,20,30,22],[31,1,31,9],[31,10,31,13],[31,14,31,19],[31,20,31,22],[34,1,34,9],[34,10,34,13],[34,14,34,18],[34,20,34,22],[35,1,35,9],[35,10,35,13],[35,14,35,19],[35,20,35,22],[36,1,36,9],[36,10,36,13],[36,14,36,19],[36,20,36,22],[37,1,37,9],[37,10,37,13],[37,14,37,19],[37,20,37,22],[38,1,38,9],[38,10,38,13],[38,14,38,19],[38,20,38,22],[39,1,39,9],[39,10,39,13],[39,14,39,19],[39,20,39,22],[40,1,40,9],[40,10,40,13],[40,14,40,19],[40,20,40,22],[41,1,41,9],[41,10,41,13],[41,14,41,19],[41,20,41,22],[42,1,42,9],[42,10,42,13],[42,14,42,19],[42,20,42,22],[43,1,43,9],[43,10,43,13],[43,14,43,19],[43,20,43,22],[44,1,44,9],[44,10,44,13],[44,14,44,19],[44,20,44,22],[49,1,49,5],[49,6,49,9],[49,10,49,14],[49,15,49,19],[49,20,49,22],[50,1,50,5],[50,6,50,9],[50,10,50,14],[50,15,50,19],[50,20,50,22],[51,1,51,5],[51,6,51,9],[51,10,51,14],[51,15,51,19],[51,20,51,22],[52,1,52,5],[52,6,52,9],[52,10,52,14],[52,15,52,19],[52,20,52,22],[53,1,53,5],[53,6,53,9],[53,10,53,14],[53,15,53,19],[53,20,53,22],[54,1,54,5],[54,6,54,9],[54,10,54,14],[54,15,54,19],[54,20,54,22],[55,1,55,5],[55,6,55,9],[55,10,55,14],[55,15,55,19],[55,20,55,22],[56,1,56,5],[56,6,56,9],[56,10,56,14],[56,15,56,19],[56,20,56,22],[57,1,57,5],[57,6,57,9],[57,10,57,14],[57,15,57,19],[57,20,57,22],[60,1,60,9],[60,10,60,13],[60,14,60,18],[60,20,60,22],[61,1,61,9],[61,10,61,13],[61,14,61,19],[61,20,61,22],[62,1,62,9],[62,10,62,13],[62,14,62,19],[62,20,62,22],[63,1,63,9],[63,10,63,13],[63,14,63,19],[63,20,63,22],[64,1,64,9],[64,10,64,13],[64,14,64,19],[64,20,64,22],[65,1,65,9],[65,10,65,13],[65,14,65,19],[65,20,65,22],[66,1,66,9],[66,10,66,13],[66,14,66,19],[66,20,66,22],[67,1,67,9],[67,10,67,13],[67,14,67,19],[67,20,67,22],[68,1,68,9],[68,10,68,13],[68,14,68,19],[68,20,68,22],[69,1,69,9],[69,10,69,13],[69,14,69,19],[69,20,69,22],[72,1,72,9],[72,10,72,13],[72,14,72,18],[72,20,72,22],[73,1,73,9],[73,10,73,13],[73,14,73,19],[73,20,73,22],[74,1,74,9],[74,10,74,13],[74,14,74,19],[74,20,74,22],[75,1,75,9],[75,10,75,13],[75,14,75,19],[75,20,75,22],[76,1,76,9],[76,10,76,13],[76,14,76,19],[76,20,76,22],[77,1,77,9],[77,10,77,13],[77,14,77,19],[77,20,77,22],[78,1,78,9],[78,10,78,13],[78,14,78,19],[78,20,78,22],[79,1,79,9],[79,10,79,13],[79,14,79,19],[79,20,79,22],[80,1,80,9],[80,10,80,13],[80,14,80,19],[80,20,80,22],[81,1,81,9],[81,10,81,13],[81,14,81,19],[81,20,81,22],[82,1,82,9],[82,10,82,13],[82,14,82,19],[82,20,82,22],[87,1,87,5],[87,6,87,9],[87,10,87,14],[87,15,87,19],[87,20,87,22],[88,1,88,5],[88,6,88,9],[88,10,88,14],[88,15,88,19],[88,20,88,22],[89,1,89,5],[89,6,89,9],[89,10,89,14],[89,15,89,19],[89,20,89,22],[90,1,90,5],[90,6,90,9],[90,10,90,14],[90,15,90,19],[90,20,90,22],[91,1,91,5],[91,6,91,9],[91,10,91,14],[91,15,91,19],[91,20,91,22],[92,1,92,5],[92,6,92,9],[92,10,92,14],[92,15,92,19],[92,20,92,22],[93,1,93,5],[93,6,93,9],[93,10,93,14],[93,15,93,19],[93,20,93,22],[94,1,94,5],[94,6,94,9],[94,10,94,14],[94,15,94,19],[94,20,94,22],[95,1,95,5],[95,6,95,9],[95,10,95,14],[95,15,95,19],[95,20,95,22],[98,1,98,9],[98,10,98,13],[98,14,98,18],[98,20,98,22],[99,1,99,9],[99,10,99,13],[99,14,99,19],[99,20,99,22],[100,1,100,9],[100,10,100,13],[100,14,100,19],[100,20,100,22],[101,1,101,9],[101,10,101,13],[101,14,101,19],[101,20,101,22],[102,1,102,9],[102,10,102,13],[102,14,102,19],[102,20,102,22],[103,1,103,9],[103,10,103,13],[103,14,103,19],[103,20,103,22],[104,1,104,9],[104,10,104,13],[104,14,104,19],[104,20,104,22],[105,1,105,9],[105,10,105,13],[105,14,105,19],[105,20,105,22],[106,1,106,9],[106,10,106,13],[106,14,106,19],[106,20,106,22],[107,1,107,9],[107,10,107,13],[107,14,107,19],[107,20,107,22],[110,1,110,9],[110,10,110,13],[110,14,110,18],[110,20,110,22],[111,1,111,9],[111,10,111,13],[111,14,111,19],[111,20,111,22],[112,1,112,9],[112,10,112,13],[112,14,112,19],[112,20,112,22],[113,1,113,9],[113,10,113,13],[113,14,113,19],[113,20,113,22],[114,1,114,9],[114,10,114,13],[114,14,114,19],[114,20,114,22],[115,1,115,9],[115,10,115,13],[115,14,115,19],[115,20,115,22],[116,1,116,9],[116,10,116,13],[116,14,116,19],[116,20,116,22],[117,1,117,9],[117,10,117,13],[117,14,117,19],[117,20,117,22],[118,1,118,9],[118,10,118,13],[118,14,118,19],[118,20,118,22],[119,1,119,9],[119,10,119,13],[119,14,119,19],[119,20,119,22],[120,1,120,9],[120,10,120,13],[120,14,120,19],[120,20,120,22],[125,1,125,5],[125,6,125,9],[125,10,125,14],[125,15,125,19],[125,20,125,22],[126,1,126,5],[126,6,126,9],[126,10,126,14],[126,15,126,19],[126,20,126,22],[127,1,127,5],[127,6,127,9],[127,10,127,14],[127,15,127,19],[127,20,127,22],[128,1,128,5],[128,6,128,9],[128,10,128,14],[128,15,128,19],[128,20,128,22],[129,1,129,5],[129,6,129,9],[129,10,129,14],[129,15,129,19],[129,20,129,22],[130,1,130,5],[130,6,130,9],[130,10,130,14],[130,15,130,19],[130,20,130,22],[131,1,131,5],[131,6,131,9],[131,10,131,14],[131,15,131,19],[131,20,131,22],[132,1,132,5],[132,6,132,9],[132,10,132,14],[132,15,132,19],[132,20,132,22],[133,1,133,5],[133,6,133,9],[133,10,133,14],[133,15,133,19],[133,20,133,22],[136,1,136,9],[136,10,136,13],[136,14,136,18],[136,20,136,22],[137,1,137,9],[137,10,137,13],[137,14,137,19],[137,20,137,22],[138,1,138,9],[138,10,138,13],[138,14,138,19],[138,20,138,22],[139,1,139,9],[139,10,139,13],[139,14,139,19],[139,20,139,22],[140,1,140,9],[140,10,140,13],[140,14,140,19],[140,20,140,22],[141,1,141,9],[141,10,141,13],[141,14,141,19],[141,20,141,22],[142,1,142,9],[142,10,142,13],[142,14,142,19],[142,20,142,22],[143,1,143,9],[143,10,143,13],[143,14,143,19],[143,20,143,22],[144,1,144,9],[144,10,144,13],[144,14,144,19],[144,20,144,22],[145,1,145,9],[145,10,145,13],[145,14,145,19],[145,20,145,22],[148,1,148,9],[148,10,148,13],[148,14,148,18],[148,20,148,22],[149,1,149,9],[149,10,149,13],[149,14,149,19],[149,20,149,22],[150,1,150,9],[150,10,150,13],[150,14,150,19],[150,20,150,22],[151,1,151,9],[151,10,151,13],[151,14,151,19],[151,20,151,22],[152,1,152,9],[152,10,152,13],[152,14,152,19],[152,20,152,22],[153,1,153,9],[153,10,153,13],[153,14,153,19],[153,20,153,22],[154,1,154,9],[154,10,154,13],[154,14,154,19],[154,20,154,22],[155,1,155,9],[155,10,155,13],[155,14,155,19],[155,20,155,22],[156,1,156,9],[156,10,156,13],[156,14,156,19],[156,20,156,22],[157,1,157,9],[157,10,157,13],[157,14,157,19],[157,20,157,22],[158,1,158,9],[158,10,158,13],[158,14,158,19],[158,20,158,22],[163,1,163,5],[163,6,163,9],[163,10,163,14],[163,15,163,19],[163,20,163,22],[164,1,164,5],[164,6,164,9],[164,10,164,14],[164,15,164,19],[164,20,164,22],[165,1,165,5],[165,6,165,9],[165,10,165,14],[165,15,165,19],[165,20,165,22],[166,1,166,5],[166,6,166,9],[166,10,166,14],[166,15,166,19],[166,20,166,22],[167,1,167,5],[167,6,167,9],[167,10,167,14],[167,15,167,19],[167,20,167,22],[168,1,168,5],[168,6,168,9],[168,10,168,14],[168,15,168,19],[168,20,168,22],[169,1,169,5],[169,6,169,9],[169,10,169,14],[169,15,169,19],[169,20,169,22],[170,1,170,5],[170,6,170,9],[170,10,170,14],[170,15,170,19],[170,20,170,22],[171,1,171,5],[171,6,171,9],[171,10,171,14],[171,15,171,19],[171,20,171,22],[174,1,174,9],[174,10,174,13],[174,14,174,18],[174,20,174,22],[175,1,175,9],[175,10,175,13],[175,14,175,19],[175,20,175,22],[176,1,176,9],[176,10,176,13],[176,14,176,19],[176,20,176,22],[177,1,177,9],[177,10,177,13],[177,14,177,19],[177,20,177,22],[178,1,178,9],[178,10,178,13],[178,14,178,19],[178,20,178,22],[179,1,179,9],[179,10,179,13],[179,14,179,19],[179,20,179,22],[180,1,180,9],[180,10,180,13],[180,14,180,19],[180,20,180,22],[181,1,181,9],[181,10,181,13],[181,14,181,19],[181,20,181,22],[182,1,182,9],[182,10,182,13],[182,14,182,19],[182,20,182,22],[183,1,183,9],[183,10,183,13],[183,14,183,19],[183,20,183,22],[186,1,186,9],[186,10,186,13],[186,14,186,18],[186,20,186,22],[187,1,187,9],[187,10,187,13],[187,14,187,19],[187,20,187,22],[188,1,188,9],[188,10,188,13],[188,14,188,19],[188,20,188,22],[189,1,189,9],[189,10,189,13],[189,14,189,19],[189,20,189,22],[190,1,190,9],[190,10,190,13],[190,14,190,19],[190,20,190,22],[191,1,191,9],[191,10,191,13],[191,14,191,19],[191,20,191,22],[192,1,192,9],[192,10,192,13],[192,14,192,19],[192,20,192,22],[193,1,193,9],[193,10,193,13],[193,14,193,19],[193,20,193,22],[194,1,194,9],[194,10,194,13],[194,14,194,19],[194,20,194,22],[195,1,195,9],[195,10,195,13],[195,14,195,19],[195,20,195,22],[196,1,196,9],[196,10,196,13],[196,14,196,19],[196,20,196,22],[201,1,201,5],[201,6,201,9],[201,10,201,14],[201,15,201,19],[201,20,201,22],[202,1,202,5],[202,6,202,9],[202,10,202,14],[202,15,202,19],[202,20,202,22],[203,1,203,5],[203,6,203,9],[203,10,203,14],[203,15,203,19],[203,20,203,22],[204,1,204,5],[204,6,204,9],[204,10,204,14],[204,15,204,19],[204,20,204,22],[205,1,205,5],[205,6,205,9],[205,10,205,14],[205,15,205,19],[205,20,205,22],[206,1,206,5],[206,6,206,9],[206,10,206,14],[206,15,206,19],[206,20,206,22],[207,1,207,5],[207,6,207,9],[207,10,207,14],[207,15,207,19],[207,20,207,22],[208,1,208,5],[208,6,208,9],[208,10,208,14],[208,15,208,19],[208,20,208,22],[209,1,209,5],[209,6,209,9],[209,10,209,14],[209,15,209,19],[209,20,209,22],[212,1,212,9],[212,10,212,13],[212,14,212,18],[212,20,212,22],[213,1,213,9],[213,10,213,13],[213,14,213,19],[213,20,213,22],[214,1,214,9],[214,10,214,13],[214,14,214,19],[214,20,214,22],[215,1,215,9],[215,10,215,13],[215,14,215,19],[215,20,215,22],[216,1,216,9],[216,10,216,13],[216,14,216,19],[216,20,216,22],[217,1,217,9],[217,10,217,13],[217,14,217,19],[217,20,217,22],[218,1,218,9],[218,10,218,13],[218,14,218,19],[218,20,218,22],[219,1,219,9],[219,10,219,13],[219,14,219,19],[219,20,219,22],[220,1,220,9],[220,10,220,13],[220,14,220,19],[220,20,220,22],[221,1,221,9],[221,10,221,13],[221,14,221,19],[221,20,221,22],[224,1,224,9],[224,10,224,13],[224,14,224,18],[224,20,224,22],[225,1,225,9],[225,10,225,13],[225,14,225,19],[225,20,225,22],[226,1,226,9],[226,10,226,13],[226,14,226,19],[226,20,226,22],[227,1,227,9],[227,10,227,13],[227,14,227,19],[227,20,227,22],[228,1,228,9],[228,10,228,13],[228,14,228,19],[228,20,228,22],[229,1,229,9],[229,10,229,13],[229,14,229,19],[229,20,229,22],[230,1,230,9],[230,10,230,13],[230,14,230,19],[230,20,230,22],[231,1,231,9],[231,10,231,13],[231,14,231,19],[231,20,231,22],[232,1,232,9],[232,10,232,13],[232,14,232,19],[232,20,232,22],[233,1,233,9],[233,10,233,13],[233,14,233,19],[233,20,233,22],[234,1,234,9],[234,10,234,13],[234,14,234,19],[234,20,234,22]]}
[null,"贡献者、参考资料和资源"]
[]
[null,null,null,null,null,"支持者名称："]
[null,null,null,null,null,"案例国家协调员："]
[null,null,null,null,null,"会议日期："]
[null,null,null,null,null,"会议地点："]
[]
[]
[null,"A部分 – 出口版本"]
[]
[null,"贡献者"]
[null,"名称",null,null,null,null,"职位说明/角色",null,null,null,"机构/实体/公司",null,null,null,null,"利益相关方类型",null,null,null,null,"说明"]
[null,null,null,null,null,null,null,null,null,null,null,null,null,null,null,null,null,null,null,null,null,null,null,null,null,"利益相关方类型"]
[null,null,null,null,null,null,null,null,null,null,null,null,null,null,null,null,null,null,null,null,null,null,null,null,null,"种植者"]
[null,null,null,null,null,null,null,null,null,null,null,null,null,null,null,null,null,null,null,null,null,null,null,null,null,"产业 – 不包括种植者"]
[null,null,null,null,null,null,null,null,null,null,null,null,null,null,null,null,null,null,null,null,null,null,null,null,null,"《国际植保公约》"]
[null,null,null,null,null,null,null,null,null,null,null,null,null,null,null,null,null,null,null,null,null,null,null,null,null,"国家植保机构 – 出口国"]
[null,null,null,null,null,null,null,null,null,null,null,null,null,null,null,null,null,null,null,null,null,null,null,null,null,"国家植保机构 – 进口国"]
[null,null,null,null,null,null,null,null,null,null,null,null,null,null,null,null,null,null,null,null,null,null,null,null,null,"其他政府机构"]
[null,null,null,null,null,null,null,null,null,null,null,null,null,null,null,null,null,null,null,null,null,null,null,null,null,"区域植保组织/粮农组织区域 – 出口"]
[null,null,null,null,null,null,null,null,null,null,null,null,null,null,null,null,null,null,null,null,null,null,null,null,null,"区域植保组织/粮农组织区域 – 进口"]
[null,"参考资料（科学文献、有害生物风险分析、灰色文献等）",null,null,null,null,null,null,null,null,null,null,null,null,null,null,null,null,null,null,null,null,null,null,null,"研究人员"]
[null,"完整参考",null,null,null,null,null,null,null,null,"简称（在工具中使用）",null,null,null,"URL/doi网址",null,null,null,null,null,"说明",null,null,null,null,"其他"]
[]
[]
[]
[]
[]
[]
[]
[]
[]
[]
[null,"其他资源（网站、工具、个人交流、启发等）"]
[null,"描述",null,null,null,null,null,null,null,null,"简称（在工具中使用）",null,null,null,"URL/doi网址",null,null,null,null,null,"说明"]
[]
[]
[]
[]
[]
[]
[]
[]
[]
[]
[]
[null,"A部分 – 进口版本"]
[]
[null,"贡献者"]
[null,"名称",null,null,null,null,"职位说明/角色",null,null,null,"机构/实体/公司",null,null,null,null,"利益相关方类型",null,null,null,null,"说明"]
[]
[]
[]
[]
[]
[]
[]
[]
[]
[null,"参考资料（科学文献、有害生物风险分析、灰色文献等）"]
[null,"完整参考",null,null,null,null,null,null,null,null,"简称（在工具中使用）",null,null,null,"URL/doi网址",null,null,null,null,null,"说明"]
[]
[]
[]
[]
[]
[]
[]
[]
[]
[]
[null,"其他资源（网站、工具、个人交流、启发等）"]
[null,"描述",null,null,null,null,null,null,null,null,"简称（在工具中使用）",null,null,null,"URL/doi网址",null,null,null,null,null,"说明"]
[]
[]
[]
[]
[]
[]
[]
[]
[]
[]
[]
[null,"B部分 – 出口版本"]
[]
[null,"贡献者"]
[null,"名称",null,null,null,null,"职位说明/角色",null,null,null,"机构/实体/公司",null,null,null,null,"利益相关方类型",null,null,null,null,"说明"]
[]
[]
[]
[]
[]
[]
[]
[]
[]
[null,"参考资料（科学文献、有害生物风险分析、灰色文献等）"]
[null,"完整参考",null,null,null,null,null,null,null,null,"简称（在工具中使用）",null,null,null,"URL/doi网址",null,null,null,null,null,"说明"]
[]
[]
[]
[]
[]
[]
[]
[]
[]
[]
[null,"其他资源（网站、工具、个人交流、启发等）"]
[null,"描述",null,null,null,null,null,null,null,null,"简称（在工具中使用）",null,null,null,"URL/doi网址",null,null,null,null,null,"说明"]
[]
[]
[]
[]
[]
[]
[]
[]
[]
[]
[]
[null,"B部分 – 进口版本"]
[]
[null,"贡献者"]
[null,"名称",null,null,null,null,"职位说明/角色",null,null,null,"机构/实体/公司",null,null,null,null,"利益相关方类型",null,null,null,null,"说明"]
[]
[]
[]
[]
[]
[]
[]
[]
[]
[null,"参考资料（科学文献、有害生物风险分析、灰色文献等）"]
[null,"完整参考",null,null,null,null,null,null,null,null,"简称（在工具中使用）",null,null,null,"URL/doi网址",null,null,null,null,null,"说明"]
[]
[]
[]
[]
[]
[]
[]
[]
[]
[]
[null,"其他资源（网站、工具、个人交流、启发等）"]
[null,"描述",null,null,null,null,null,null,null,null,"简称（在工具中使用）",null,null,null,"URL/doi网址",null,null,null,null,null,"说明"]
[]
[]
[]
[]
[]
[]
[]
[]
[]
[]
[]
[null,"C部分 - 出口版本"]
[]
[null,"贡献者"]
[null,"名称",null,null,null,null,"职位说明/角色",null,null,null,"机构/实体/公司",null,null,null,null,"利益相关方类型",null,null,null,null,"说明"]
[]
[]
[]
[]
[]
[]
[]
[]
[]
[null,"参考资料（科学文献、有害生物风险分析、灰色文献等）"]
[null,"完整参考",null,null,null,null,null,null,null,null,"简称（在工具中使用）",null,null,null,"URL/doi网址",null,null,null,null,null,"说明"]
[]
[]
[]
[]
[]
[]
[]
[]
[]
[]
[null,"其他资源（网站、工具、个人交流、启发等）"]
[null,"描述",null,null,null,null,null,null,null,null,"简称（在工具中使用）",null,null,null,"URL/doi网址",null,null,null,null,null,"说明"]
[]
[]
[]
[]
[]
[]
[]
[]
[]
[]
[]
[null,"C部分 – 进口版本"]
[]
[null,"贡献者"]
[null,"名称",null,null,null,null,"职位说明/角色",null,null,null,"机构/实体/公司",null,null,null,null,"利益相关方类型",null,null,null,null,"说明"]
[]
[]
[]
[]
[]
[]
[]
[]
[]
[null,"参考资料（科学文献、有害生物风险分析、灰色文献等）"]
[null,"完整参考",null,null,null,null,null,null,null,null,"简称（在工具中使用）",null,null,null,"URL/doi网址",null,null,null,null,null,"说明"]
[]
[]
[]
[]
[]
[]
[]
[]
[]
[]
[null,"其他资源（网站、工具、个人交流、启发等）"]
[null,"描述",null,null,null,null,null,null,null,null,"简称（在工具中使用）",null,null,null,"URL/doi网址",null,null,null,null,null,"说明"]

{"sheet":"Non editable text ","index":10,"n_rows":27,"n_cols":3,"rows_kept":27,"cut":false,"hidden":true,"merged":[]}
[]
[null,"GOOGLE  TRANSLATION FOR ADRIAN"]
["主表","Primary table","I think this should be 'Main'"]
["出口 ","Export"]
["完成A部分，定义作物、有害生物和贸易国家","Complete Part A to define crops, pests and trading countries"]
["A部分 - 背景信息","Part A-background information"]
["B部分 - 措施选择","Part B-Choice of Measures"]
["C部分 - 措施评价","Part C-Measures Evaluation"]
[]
["Sheet part A ",{"$f":"A10","v":"Sheet part A "}]
["A部分 制定系统方法的背景信息","Part A Background information for the development of a systematic approach"]
["贡献者、参考资料和资源","Contributors, references and resources"]
["返回主页","return to home page"]
["B部分 入围候选措施","Part B Shortlisted Candidate Measures"]
[]
["Sheet part B ",{"$f":"A16","v":"Sheet part B "}]
["B部分 制定发展系统方法的措施 ","Part B Measures to develop a systematic approach"]
["C部分 - 措施可视化","Part C-Visualization of Measures"]
["返回A部分","Back to Part A"]
["选择供评估措施（最多20个）后，请单击此处，以列出要读入C部分表C1和C2的列表。","After selecting the measures for evaluation (up to 20), please click here to list the lists to be read into Part C Tables C1 and C2."]
[]
[]
["Sheet part C ",{"$f":"A23","v":"Sheet part C "}]
["C部分：制定系统方法的评价措施说明","Part C: Description of evaluation measures for formulating a systematic approach"]
[]
["Sheet Contrib resources ",{"$f":"A26","v":"Sheet Contrib resources "}]
["返回工作表","Back to worksheet"]

{"sheet":"Uncertainy tables (Beta)","index":11,"n_rows":31,"n_cols":21,"rows_kept":31,"cut":false,"hidden":true,"merged":[[6,1,30,1],[6,2,10,2],[11,2,15,2],[16,2,20,2],[21,2,25,2],[26,2,30,2],[6,3,30,3],[6,12,30,12],[6,13,10,13],[11,13,15,13],[16,13,20,13],[21,13,25,13],[26,13,30,13],[6,14,30,14]]}
[]
[]
[null,null,null,null,null,null,null,"Even class boundaries",null,null,null,null,null,null,null,null,null,null,"IPCC class boundaries (uneven)"]
[null,null,null,null,null,null,"Uncertainty",null,null,null,null,null,null,null,null,null,null,"Uncertainty"]
[null,null,null,null,null,null,"VL","L","M","H",null,null,null,null,null,null,null,"VL","L","M","H"]
[null,null,null,null,null,null,1,2,3,4,null,null,null,null,null,null,null,1,2,3,4]
[null,"Selected score",1,"D  i  s  t  r  i  b  u  t  e  d       s  c  o  r  e  s",1,1,0.9,0.8,0.5,0.35,null,null,"Selected score",1,"D  i  s  t  r  i  b  u  t  e  d       s  c  o  r  e  s",1,1,0.9,0.8,0.5,0.35]
[null,null,null,null,2,2,0.1,0.2,0.35,0.3,null,null,null,null,null,2,2,0.1,0.2,0.47,0.52]
[null,null,null,null,3,3,0,0,0.13,0.21,null,null,null,null,null,3,3,0,0,0.03,0.13]
[null,null,null,null,4,4,0,0,0.02,0.11,null,null,null,null,null,4,4,0,0,0,0]
[null,null,null,null,5,5,0,0,0,0.03,null,null,null,null,null,5,5,0,0,0,0]
[null,null,2,null,1,6,0.03,0.07,0.17,0.21,null,null,null,2,null,1,6,0.01,0.03,0.1,0.11]
[null,null,null,null,2,7,0.9,0.8,0.5,0.35,null,null,null,null,null,2,7,0.9,0.8,0.5,0.35]
[null,null,null,null,3,8,0.07,0.13,0.28,0.28,null,null,null,null,null,3,8,0.09,0.17,0.37,0.4]
[null,null,null,null,4,9,0,0,0.05,0.14,null,null,null,null,null,4,9,0,0,0.03,0.13]
[null,null,null,null,5,10,0,0,0,0.02,null,null,null,null,null,5,10,0,0,0,0.01]
[null,null,3,null,1,11,0,0,0.01,0.07,null,null,null,3,null,1,11,0,0,0.02,0.09]
[null,null,null,null,2,12,0.05,0.1,0.24,0.255,null,null,null,null,null,2,12,0.05,0.1,0.23,0.235]
[null,null,null,null,3,13,0.9,0.8,0.5,0.35,null,null,null,null,null,3,13,0.9,0.8,0.5,0.35]
[null,null,null,null,4,14,0.05,0.1,0.24,0.255,null,null,null,null,null,4,14,0.05,0.1,0.23,0.235]
[null,null,null,null,5,15,0,0,0.01,0.07,null,null,null,null,null,5,15,0,0,0.02,0.09]
[null,null,4,null,1,16,0,0,0,0.02,null,null,null,4,null,1,16,0,0,0,0.01]
[null,null,null,null,2,17,0,0,0.05,0.14,null,null,null,null,null,2,17,0,0,0.03,0.13]
[null,null,null,null,3,18,0.07,0.13,0.28,0.28,null,null,null,null,null,3,18,0.09,0.17,0.37,0.4]
[null,null,null,null,4,19,0.9,0.8,0.5,0.35,null,null,null,null,null,4,19,0.9,0.8,0.5,0.35]
[null,null,null,null,5,20,0.03,0.07,0.17,0.21,null,null,null,null,null,5,20,0.01,0.03,0.1,0.11]
[null,null,5,null,1,21,0,0,0,0.03,null,null,null,5,null,1,21,0,0,0,0]
[null,null,null,null,2,22,0,0,0.02,0.11,null,null,null,null,null,2,22,0,0,0,0]
[null,null,null,null,3,23,0,0,0.13,0.21,null,null,null,null,null,3,23,0,0,0.03,0.13]
[null,null,null,null,4,24,0.1,0.2,0.35,0.3,null,null,null,null,null,4,24,0.1,0.2,0.47,0.52]
[null,null,null,"Distributed score",5,25,0.9,0.8,0.5,0.35,null,null,null,null,"Distributed score",5,25,0.9,0.8,0.5,0.35]